{"text_format":"3","workbook":"xlsx","n_sheets":14,"sheets":["Instructions","Federal standards","MN bulk ag. rule","Grain elevator potential","Grain elevator actual","Feed mill potential","Feed mill actual","Natural gas dryer","Propane dryer","Fugitive","Potential emissions","Actual emissions","Permits & requirements","Data validation"],"not_rendered":{"images":3,"defined_names":28},"read":"whole","date_system":"1900"}

{"sheet":"Instructions","index":0,"n_rows":34,"n_cols":6,"rows_kept":34,"merged":[[0,1,3,4],[0,5,0,14],[1,5,3,14],[4,1,4,14],[5,1,5,14],[6,1,8,14],[9,1,9,14],[10,1,11,14],[12,1,13,14],[14,1,14,14],[16,1,16,14],[17,2,17,14],[18,2,18,14],[19,2,19,14],[20,2,20,14],[21,2,21,14],[24,1,24,14],[25,1,25,14],[26,1,26,14],[27,2,27,3],[27,5,27,8],[27,10,27,14],[28,2,28,3],[28,4,28,14],[30,1,30,3],[30,4,30,13],[32,1,32,8],[33,1,33,10],[33,11,33,14]]}
[{"$nulls":5},"Grain elevators and feed mills\nAir emissions calculator"]
[{"$nulls":5},"p-sbap5-28  •  7/28/25"]
[]
[]
[null,"Instructions"]
[null,"1) Start with the Federal Standards tab to identify if a federal rule applies to your business."]
[null,"2) Next, go to the MN Bulk Ag. Rule tab. Find out about nuisance rules that all grain handling facilities are required to follow, Minnesota's rules for bulk\n    agricultural commodities, and whether you need to control emissions (either by using emission control equipment, other means of controlling or\n    minimizing emissions)."]
[]
{"$rows_left_out":27}
{"sheet":"Federal standards","index":1,"n_rows":48,"n_cols":14,"rows_kept":48,"merged":[[0,1,0,14],[1,1,1,14],[3,1,3,12],[3,13,3,14],[4,1,4,12],[4,13,8,14],[5,2,5,12],[6,2,7,12],[8,2,8,12],[9,1,9,12],[9,13,13,14],[10,2,10,9],[11,2,12,12],[13,2,13,12],[14,1,14,14],[15,1,15,6],[15,7,15,14],[17,1,17,14],[18,1,19,14],[20,2,20,10],[21,2,21,10],[22,2,22,10],[23,1,23,14],[24,1,24,14],[25,2,25,14],[26,2,26,14],[27,2,27,14],[28,2,28,14],[29,1,29,14],[30,1,30,7],[30,8,30,9],[30,10,30,12],[30,13,30,14],[32,1,32,12],[32,13,32,14],[33,1,33,12],[33,13,36,14],[34,1,37,12],[37,13,39,14],[39,2,39,12],[41,1,41,12],[41,13,41,14],[42,1,43,12],[42,13,45,14],[44,2,45,12],[46,2,46,6],[46,7,46,13],[47,2,47,8],[47,9,47,15]]}
[null,{"$f":"Instructions!F2","v":"p-sbap5-28  •  7/28/25"}]
[null,"U.S. Environmental Protection Agency (EPA) new source performance standards (NSPS) "]
[]
[null,"Does the federal new source performance standard for grain elevators apply?",{"$nulls":11},"Choose Y/N"]
[null,"This standard applies to unloading stations, loading stations, grain dryers, and grain handling operations that:",{"$nulls":11},{"$f":"IF($N$4=\"Yes\",\"Because an NSPS applies to your operation, you need an air permit.\",IF($N$4=\"No\",\"Continue to the next question below.\",IF($N$4=\"Choose Y/N\",\" \",\" \")))","v":" "}]
[null,"1)","were constructed, modified, or reconstructed after August 3, 1978, and"]
[null,"2)","are not located at animal food manufacturers, pet food manufacturers, cereal manufacturers, breweries, or livestock feedlots, and"]
[]
{"$rows_left_out":41}
{"sheet":"MN bulk ag. rule","index":2,"n_rows":83,"n_cols":13,"rows_kept":83,"merged":[[0,1,0,14],[1,1,1,14],[2,1,2,14],[3,1,3,14],[4,2,4,14],[5,2,5,14],[6,1,7,14],[8,1,8,14],[9,1,11,14],[12,2,12,4],[12,5,12,6],[12,8,12,10],[12,11,12,13],[13,2,13,8],[13,9,13,14],[14,1,15,14],[16,1,16,14],[17,1,17,11],[17,12,17,14],[18,2,18,14],[19,2,20,14],[21,1,22,14],[23,1,23,14],[24,1,24,14],[25,1,25,14],[26,2,26,14],[27,2,27,14],[28,1,28,14],[29,1,29,14],[30,2,30,7],[30,9,30,14],[31,2,31,14],[32,1,32,14],[33,1,33,7],[33,8,33,11],[35,1,35,14],[36,1,36,14],[37,1,39,14],[40,2,40,15],[41,2,41,14],[42,2,42,10],[42,11,42,15],[44,1,44,14],[45,2,45,14],[46,2,46,14],[47,2,48,14],[49,2,50,14],[52,1,52,11],[52,12,52,14],[53,2,53,14],[54,2,54,14],[55,2,55,14],[56,2,56,14],[57,2,58,14],[59,2,60,14],[62,1,62,14],[63,1,64,14],[65,1,65,14],[66,3,66,14],[67,3,67,14],[68,3,68,14],[69,3,70,14],[71,1,71,14],[72,11,72,14],[74,1,74,14],[75,1,75,14],[76,2,76,14],[77,2,77,14],[78,3,78,14],[79,3,79,14],[80,1,81,14],[82,11,82,14]]}
[null,{"$f":"Instructions!F2","v":"p-sbap5-28  •  7/28/25"}]
[null,"Minnesota bulk agricultural nuisance rule"]
[null,"All grain and commodity facilities in Minnesota must comply with the bulk ag. nuisance rule"]
[null,"The rule states:"]
[null,"· ","Grain or commodity facilities may not operate or maintain a facility that creates a public nuisance, and"]
[null,"· ","If the operation or maintenance of a facility creates a public nuisance, you are required to eliminate the nuisance."]
[]
[]
{"$rows_left_out":76}
{"sheet":"Grain elevator potential","index":3,"n_rows":76,"n_cols":12,"rows_kept":76,"merged":[[0,1,0,11],[1,1,1,11],[2,1,2,11],[3,6,3,11],[4,1,4,11],[5,1,5,11],[7,1,7,2],[7,3,8,11],[9,2,9,5],[15,1,15,2],[15,3,16,11],[17,2,17,5],[19,1,19,11],[20,1,20,11],[21,1,21,2],[21,3,21,4],[23,1,23,4],[25,1,25,2],[32,1,32,11],[37,1,38,11],[39,1,39,11],[40,1,42,1],[40,2,42,11],[43,1,46,1],[43,2,46,11],[47,1,48,1],[47,2,48,11],[49,1,49,11],[50,8,50,11],[51,1,51,2],[52,3,53,3],[52,4,53,4],[52,5,53,5],[52,6,53,6],[52,7,53,7],[52,8,53,8],[52,9,53,9],[52,10,53,10],[52,11,53,11],[53,1,55,2],[56,1,61,1],[56,4,71,4],[56,7,71,7],[62,1,65,1],[66,1,66,2],[67,1,67,2],[68,1,68,2],[69,1,71,1],[72,1,72,4],[73,1,73,5],[73,6,73,11],[74,1,74,11],[75,1,76,11]]}
[null,{"$f":"Instructions!F2","v":"p-sbap5-28  •  7/28/25"}]
[null,"Air emissions for grain elevators - Potential emissions"]
[null,"Important: If you are applying for a state or federal individual air permit, do not use this tab for your application. Individual permit applications must calculate potential emissions for each "]
[null,"emission unit. Guidance is available at MPCA's air permit emission calculation page:",{"$nulls":4},"https://www.pca.state.mn.us/business-with-us/calculating-emissions"]
[null,"Calculate your facility's maximum capacity."]
[null,"There are two classifications of elevators.1 The type of elevator you are will determine how to calculate the facility's maximum capacity."]
[]
[null,"Country elevator: ",null,"Receives more than 50 percent of its grain from farmers in the immediate vicinity during the harvest season. Maximum capacity is calculated as the largest amount of grain that arrived at or was handled by your facility in the past five years increased by 20% to allow for annual variations."]
{"$rows_left_out":69}
{"sheet":"Grain elevator actual","index":4,"n_rows":43,"n_cols":12,"rows_kept":43,"merged":[[1,1,1,11],[2,1,2,11],[3,2,3,11],[4,1,7,1],[4,2,7,11],[8,1,11,1],[8,2,11,11],[12,1,12,11],[13,1,13,7],[13,8,13,11],[14,1,14,2],[15,1,18,2],[15,3,16,3],[15,4,16,4],[15,5,16,5],[15,6,16,6],[15,7,16,7],[15,8,16,8],[15,9,16,9],[15,10,16,10],[15,11,16,11],[19,1,24,1],[25,1,28,1],[29,1,29,2],[30,1,30,2],[31,1,31,2],[32,1,34,1],[37,1,37,5],[37,6,37,11],[38,1,38,5],[38,6,38,11],[39,1,39,5],[39,6,39,11],[40,1,40,5],[40,6,40,11],[41,1,41,11],[42,1,43,10]]}
[{"$nulls":11},{"$f":"Instructions!F2","v":"p-sbap5-28  •  7/28/25"}]
[null,"Air emissions for grain elevators - Actual emissions"]
[null,"What you need to know about the calculations:"]
[null,"1)","In the table below, enter in the blue cells the actual quantities of grain received, loaded out, cleaned, and dried during the past 12 months."]
[null,"2)","The emissions from the headhouse and handling are calculated each time the grain is elevated. In actual emission calculations, as shown in the table below, it is assumed that the actual capacity of grain is received, then elevated for storage, then elevated again for shipping. In addition, the grain is assumed to be elevated again after cleaning and after drying, if those activities take place at the facility. Emissions from storage bin vents occur when grain is put into storage bins or silos - after it is received, after cleaning, and after drying. This is the method of calculation prescribed by EPA in AP-42, section 9.9.1.3."]
[]
[]
[]
{"$rows_left_out":36}
{"sheet":"Feed mill potential","index":5,"n_rows":61,"n_cols":12,"rows_kept":61,"merged":[[1,1,1,11],[2,1,2,11],[3,6,3,11],[4,1,4,11],[5,2,5,3],[5,5,6,11],[6,2,6,3],[7,1,7,11],[8,1,8,4],[10,1,10,3],[11,1,11,2],[15,1,15,3],[15,6,15,9],[16,1,16,3],[16,6,16,9],[18,1,18,3],[19,1,19,2],[22,1,23,11],[24,1,24,11],[25,1,26,1],[25,2,26,11],[27,1,30,1],[27,2,30,11],[31,1,32,1],[31,2,32,11],[33,1,33,11],[34,1,34,7],[34,8,34,11],[35,1,35,2],[36,1,39,2],[36,3,37,3],[36,4,37,4],[36,5,37,5],[36,6,37,6],[36,7,37,7],[36,8,37,8],[36,9,37,9],[36,10,37,10],[36,11,37,11],[40,1,40,2],[40,4,51,4],[40,7,51,7],[41,1,41,2],[42,1,44,1],[45,1,45,2],[46,1,46,2],[47,1,47,2],[48,1,48,2],[49,1,51,1],[53,1,54,11],[55,1,56,11],[57,1,58,11],[59,1,59,11],[60,1,61,11]]}
[{"$nulls":11},{"$f":"Instructions!F2","v":"p-sbap5-28  •  7/28/25"}]
[null,"Air emissions for feed mills - Potential emissions"]
[null,"Important: If you are applying for a state or federal individual air permit, do not use this tab for your application. Individual permit applications must calculate potential emissions for each "]
[null,"emission unit. Guidance is available at MPCA's air permit emission calculation page:",{"$nulls":4},"https://www.pca.state.mn.us/business-with-us/calculating-emissions"]
[null,"Facility information for emission calculations"]
[null,"Facility name:",{"$nulls":3},"For grain processing facilities, max. capacity is the maximum amount of grain you could possibly process in a year assuming an unlimited supply is available."]
[null,"Max. capacity:",null,null,"tons/year "]
[]
{"$rows_left_out":54}
{"sheet":"Feed mill actual","index":6,"n_rows":45,"n_cols":12,"rows_kept":45,"merged":[[0,1,0,11],[1,1,1,11],[2,1,2,11],[3,2,3,11],[4,1,7,1],[4,2,7,11],[8,1,11,1],[8,2,11,11],[12,1,12,11],[13,1,13,7],[13,8,13,11],[14,1,14,2],[15,1,18,2],[15,3,16,3],[15,4,16,4],[15,5,16,5],[15,6,16,6],[15,7,16,7],[15,8,16,8],[15,9,16,9],[15,10,16,10],[15,11,16,11],[19,1,19,2],[20,1,20,2],[21,1,23,1],[24,1,24,2],[25,1,25,2],[26,1,26,2],[27,1,27,2],[28,1,30,1],[33,1,33,5],[33,6,33,11],[34,1,34,5],[34,6,34,11],[35,1,35,5],[35,6,35,11],[36,1,36,5],[36,6,36,11],[37,1,38,11],[39,1,40,11],[41,1,42,11],[43,1,43,11],[44,1,45,11]]}
[null,{"$f":"Instructions!F2","v":"p-sbap5-28  •  7/28/25"}]
[null,"Air emissions for feed mills - Actual emissions"]
[null,"What you need to know about the calculations:"]
[null,"1)","In the table below, enter in the blue cells the actual quantities of product received, loaded out, milled, cleaned, and dried during the past 12 months.  "]
[null,"2)","The emissions from the headhouse and handling are calculated each time the grain is elevated. In actual emission calculations, as shown in the table below, it is assumed that the actual capacity of grain is received, then elevated for storage, then elevated again for shipping. In addition, the grain is assumed to be elevated again after cleaning and after drying, if those activities take place at the facility. Emissions from storage bin vents occur when grain is put into storage bins or silos after it is received, after cleaning, and after drying. This is the method of calculation specified by EPA in AP-42, section 9.9.1.3."]
[]
[]
[]
{"$rows_left_out":38}
{"sheet":"Natural gas dryer","index":7,"n_rows":49,"n_cols":17,"rows_kept":49,"merged":[[0,1,0,10],[1,1,1,8],[1,12,1,17],[2,1,3,8],[2,12,3,13],[2,14,3,15],[2,16,3,17],[4,1,4,8],[4,12,5,13],[4,14,5,15],[4,16,5,17],[5,1,5,8],[6,1,6,5],[6,12,7,13],[6,14,7,15],[6,16,7,17],[7,1,7,3],[7,4,7,5],[7,7,7,8],[7,10,7,11],[8,12,10,13],[8,14,10,15],[8,16,10,17],[9,1,9,8],[11,1,12,1],[11,2,12,2],[11,3,12,3],[11,4,12,4],[11,5,12,5],[11,6,12,6],[11,7,12,7],[11,8,12,8],[11,10,12,10],[14,10,15,10],[16,1,16,5],[25,1,25,5],[30,1,30,5],[46,1,46,8],[47,1,47,8],[48,1,48,5],[48,6,48,7]]}
[null,{"$f":"Instructions!F2","v":"p-sbap5-28  •  7/28/25"}]
[null,"Air emissions from natural gas grain dryers",{"$nulls":10},"Tip: How to use this calculator"]
[null,"Natural gas combustion (less than 100 million Btu per hour)",{"$nulls":10},"If you have…",null,"For potential emissions",null,"For actual emissions"]
[]
[null,"If you have a boiler with a rating of more than 100 million Btu per hour, different emission factors must be used (see EPA AP-42 Chapter 1.4).",{"$nulls":10},"One process/heating unit",null,"Enter maximum rated heat input",null,"Enter amount of fuel burned or actual operation hours"]
[]
[null,"What is the total maximum rated heat input for your natural gas units?",{"$nulls":4},0,"Btu per hour","(Check your units!)",{"$nulls":3},"More than one process/heating unit",null,"Enter the total maximum rated heat input of all units, combined",null,"Enter amount of fuel burned. Do not use operation hours."]
[null,"In the previous 12 months, how many",null,null,"Choose one",null,0,{"$f":"IF(E8='Data validation'!A31,\" \",IF(E8='Data validation'!A32,\"hours/year\",IF(E8='Data validation'!A33,\"cu ft/year\")))","v":" "}]
{"$rows_left_out":42}
{"sheet":"Propane dryer","index":8,"n_rows":50,"n_cols":17,"rows_kept":50,"merged":[[0,1,0,10],[1,1,1,10],[1,12,1,17],[2,1,2,8],[2,12,3,13],[2,14,3,15],[2,16,3,17],[4,1,4,5],[4,12,5,13],[4,14,5,15],[4,16,5,17],[5,1,5,3],[5,4,5,5],[5,7,5,8],[6,1,6,6],[6,12,7,13],[6,14,7,15],[6,16,7,17],[7,1,7,5],[7,7,7,8],[8,1,9,8],[8,12,10,13],[8,14,10,15],[8,16,10,17],[10,1,10,8],[12,1,13,1],[12,2,13,2],[12,3,13,3],[12,4,13,4],[12,5,13,5],[12,6,13,6],[12,7,13,7],[12,8,13,8],[12,10,13,10],[15,10,16,10],[17,1,17,5],[26,1,26,5],[31,1,31,5],[47,1,47,8],[48,1,48,8],[49,1,49,5],[49,6,49,7]]}
[null,{"$f":"Instructions!F2","v":"p-sbap5-28  •  7/28/25"}]
[null,"Air emissions from propane grain dryers",{"$nulls":10},"Tip: How to use this calculator"]
[null,"Propane combustion",{"$nulls":10},"If you have…",null,"For potential emissions",null,"For actual emissions"]
[]
[null,"What is the total maximum rated heat input for your propane dryers?",{"$nulls":4},0,"Btu per hour","(Check your units!)",{"$nulls":3},"One process/heating unit",null,"Enter maximum rated heat input",null,"Enter amount of fuel burned or actual operation hours"]
[null,"In the previous 12 months, how many ",null,null,"Choose one",null,0,{"$f":"IF(E6='Data validation'!A36,\" \",IF(E6='Data validation'!A37,\"hours/year\",IF(E6='Data validation'!A38,\"gallons/year\")))","v":" "}]
[{"$nulls":7},{"$f":"IF(H6=\"hours/year\",\"(only use if assessing emissions from one unit)\",\" \")","v":" "},{"$nulls":4},"More than one process/heating unit",null,"Enter the total maximum rated heat input of all units, combined",null,"Enter amount of fuel burned. Do not use operation hours."]
[null,"Sulfur content of propane",{"$nulls":4},0.18,"grains/100 cubic feet"]
{"$rows_left_out":43}
{"sheet":"Fugitive","index":9,"n_rows":88,"n_cols":19,"rows_kept":88,"merged":[[0,1,0,8],[1,1,1,8],[2,1,2,8],[3,1,3,8],[4,1,5,8],[6,2,6,3],[6,4,7,8],[8,1,8,8],[9,1,9,8],[10,1,10,8],[11,2,11,3],[12,1,13,1],[12,2,13,3],[12,4,15,7],[14,1,15,1],[14,2,15,3],[16,1,17,8],[18,1,18,8],[19,1,19,8],[20,1,20,4],[21,1,21,2],[22,1,22,2],[23,1,23,2],[26,1,26,2],[26,6,26,7],[27,1,27,2],[27,6,27,7],[28,1,28,2],[28,6,28,7],[29,1,29,2],[30,1,30,2],[31,1,31,2],[32,1,32,2],[33,1,33,2],[33,5,33,8],[34,1,34,2],[34,4,34,7],[35,1,35,2],[35,4,35,7],[36,1,36,2],[36,6,36,7],[37,1,38,8],[39,1,39,8],[40,1,41,2],[41,5,42,5],[41,6,42,6],[41,7,42,7],[41,8,42,8],[42,1,43,2],[46,1,46,8],[47,1,47,7],[48,1,48,2],[48,6,48,8],[49,1,49,2],[49,5,49,7],[50,1,50,2],[50,6,50,7],[51,1,51,2],[52,1,52,2],[55,1,55,8],[56,1,60,1],[56,2,57,3],[56,4,57,5],[56,6,57,7],[58,2,58,3],[58,4,58,5],[58,6,58,7],[58,8,60,8],[59,2,60,2],[59,3,60,3],[59,4,60,4],[59,5,60,5],[59,6,60,6],[59,7,60,7],[66,1,70,1],[66,2,67,3],[66,4,67,5],[66,6,67,7],[68,2,68,3],[68,4,68,5],[68,6,68,7],[68,8,70,8],[69,2,70,2],[69,3,70,3],[69,4,70,4],[69,5,70,5],[69,6,70,6],[69,7,70,7],[78,2,78,3],[78,6,78,7],[79,1,79,3],[80,1,80,4],[80,5,80,8],[81,1,81,4],[81,5,81,8],[82,6,82,8],[83,1,89,2],[83,3,83,4],[83,5,83,6],[84,3,84,4],[84,5,84,8],[86,3,86,4],[86,5,86,8]]}
[null,{"$f":"Instructions!F2","v":"p-sbap5-28  •  7/28/25"}]
[null,"Air emissions from fugitive sources"]
[null,"Fugitive emissions1"]
[null,"Potential emissions"]
[null,"Your potential emissions from fugitive sources must be used in identifying whether a permit is required. Fugitive sources include unpaved roads, material handling at stockpiles, and wind erosion of ground piles. "]
[]
[null,null,"Throughput (maximum capacity)",null,"<-------- Enter the throughput used in the 'grain elevator potential' tab here. "]
[null,null,{"$f":"'Grain elevator potential'!$D$22+'Feed mill potential'!$C$7","v":{"v":0,"d":"0 "}},"tons/year"]
{"$rows_left_out":81}
{"sheet":"Potential emissions","index":10,"n_rows":37,"n_cols":12,"rows_kept":37,"merged":[[0,1,0,8],[1,1,1,8],[2,1,2,8],[2,10,2,11],[3,1,5,1],[3,2,4,2],[3,3,4,3],[3,4,4,4],[3,5,4,5],[3,6,4,6],[3,7,4,7],[3,8,4,8],[3,10,4,10],[3,11,4,11],[6,1,6,3],[15,1,15,8],[20,1,20,8],[22,11,30,11],[31,11,32,11]]}
[null,{"$f":"Instructions!F2","v":"p-sbap5-28  •  7/28/25"}]
[null,"Potential emissions: Grain elevators and feed mills"]
[null,{"$f":"IF('Data validation'!B20=\"yes\",\"The flag next to a potential emission total means your potential emissions exceed the permitting threshold and a permit is required.\",\"These pollutant totals represent the information you entered in the blue tabs.\")","v":"These pollutant totals represent the information you entered in the blue tabs."},{"$nulls":8},"Without Insignificant Activities"]
[null,"Pollutant","Grain Elevator","Feed Mill","Natural Gas","Propane","Fugitive","Potential Emissions","Permitting Threshold",null,"Potential Emissions","Insignificant Activity Limits"]
[]
[null,null,"(ton/yr)","(ton/yr)","(ton/yr)","(ton/yr)","(ton/yr)","(ton/yr)","(ton/yr)",null,"(ton/yr)","(ton/yr)"]
[null,"Criteria Air Pollutants",null,null,{"$f":"IF('Natural gas dryer'!J17=7,\"Insignificant Activity\",\" \")","v":"Insignificant Activity"},{"$f":"IF('Propane dryer'!J20=7,\"Insignificant Activity\",\" \")","v":"Insignificant Activity"}]
[null,"PM",{"$f":"'Grain elevator potential'!G73","v":{"v":0,"d":"0.00"}},{"$f":"'Feed mill potential'!G53","v":{"v":0,"d":"0.00"}},{"$f":"'Natural gas dryer'!H18","v":{"v":0,"d":"0.00"}},{"$f":"'Propane dryer'!H19","v":{"v":0,"d":"0.00"}},{"$f":"Fugitive!I62","v":{"v":0,"d":"0.00"}},{"$f":"SUM(C8:G8)","v":{"v":0,"d":"0.00"}},100,null,{"$f":"H8+IF($E$7=\"Insignificant Activity\",-E8,0)+IF($F$7=\"Insignificant Activity\",-F8,0)","v":{"v":0,"d":"0.00"}},{"v":1,"d":"1.0"}]
{"$rows_left_out":30}
{"sheet":"Actual emissions","index":11,"n_rows":37,"n_cols":9,"rows_kept":37,"merged":[[0,1,0,8],[1,1,1,8],[2,1,2,8],[3,1,5,1],[3,2,4,2],[3,3,4,3],[3,4,4,4],[3,5,4,5],[3,6,4,6],[3,7,4,7],[3,8,4,8],[6,1,6,8],[15,1,15,8],[20,1,20,8]]}
[null,{"$f":"Instructions!F2","v":"p-sbap5-28  •  7/28/25"}]
[null,"Actual emissions: Grain elevators and feed mills"]
[null,{"$f":"IF('Data validation'!B23=\"yes\",\"The flag next to your actual emissions total indicates that your business exceeds the Option D limit and an individual permit is required.\",\"These pollutant totals represent the information you entered in the blue tabs.\")","v":"These pollutant totals represent the information you entered in the blue tabs."}]
[null,"Pollutant","Grain Elevator","Feed Mill","Natural Gas","Propane","Fugitive","Actual Emissions","Opt. D Permit Limits"]
[]
[null,null,"(ton/yr)","(ton/yr)","(ton/yr)","(ton/yr)","(ton/yr)","(ton/yr)","(ton/yr)"]
[null,"Criteria Air Pollutants"]
[null,"PM",{"$f":"'Grain elevator actual'!G36","v":{"v":0,"d":"0.00"}},{"$f":"'Feed mill actual'!G32","v":{"v":0,"d":"0.00"}},{"$f":"'Natural gas dryer'!I18","v":{"v":0,"d":"0.00"}},{"$f":"'Propane dryer'!I19","v":{"v":0,"d":"0.00"}},{"$f":"Fugitive!I72","v":{"v":0,"d":"0.00"}},{"$f":"SUM(C8:G8)","v":{"v":0,"d":"0.00"}},50]
{"$rows_left_out":30}
{"sheet":"Permits & requirements","index":12,"n_rows":41,"n_cols":9,"rows_kept":41,"merged":[[0,1,0,8],[1,1,1,8],[2,1,5,8],[6,1,7,8],[9,1,9,4],[9,5,17,8],[10,1,10,4],[11,1,12,1],[11,2,12,2],[11,3,12,3],[11,4,12,4],[13,1,15,1],[13,2,15,2],[13,3,15,3],[13,4,15,4],[16,1,17,1],[16,2,17,2],[16,3,17,3],[16,4,17,4],[18,1,21,1],[18,2,21,2],[18,3,21,3],[18,4,21,4],[18,5,21,6],[18,7,21,7],[18,8,21,8],[22,4,27,4],[22,5,22,6],[23,5,23,6],[23,7,25,7],[23,8,25,8],[24,5,24,6],[25,5,25,6],[26,5,26,6],[26,7,27,7],[26,8,27,8],[27,5,27,6],[29,1,29,2],[29,3,29,4],[30,2,30,8],[31,2,31,8],[32,2,33,8],[34,1,36,8],[37,1,38,8],[40,1,40,8]]}
[null,{"$f":"Instructions!F2","v":"p-sbap5-28  •  7/28/25"}]
[null,"Permits and requirements"]
[null,"The need for a permit is based on your entire business's potential air emissions. All activities that put pollutants into the air (including paint and solvent use, fuel use for stationary equipment, and other activities - not associated with maintenance) need to be assessed in addition to the grain, mill, and dryer emissions included in this calculator. Once you determine if you need a permit, based on whether an NSPS applies and your total potential emissions, you can then use your actual emissions to see which permit is the best fit for your business."]
[]
[]
[]
[null,"Content below is based on the information entered into this calculator and is not an official MPCA permit determination."]
[]
{"$rows_left_out":34}
{"sheet":"Data validation","index":13,"n_rows":38,"n_cols":2,"rows_kept":38,"hidden":true,"merged":[[0,0,0,1],[1,0,1,1]]}
[{"$f":"Instructions!F2","v":"p-sbap5-28  •  7/28/25"}]
["Data Validation"]
[]
["State Standards tab","Equation/reference"]
["Choose one","NSPS applies"]
["Located in Anoka, Carver, Dakota, Hennepin, Ramsey, Scott, or Washington County",{"$f":"SUM(B7:B9)","v":0}]
["Located in a city with a population of 7,500 people or more",{"$f":"COUNTIF('Federal standards'!N4,\"Yes\")","v":0}]
["Located in a city with a population of less than 7,500 people",{"$f":"COUNTIF('Federal standards'!N42,\"Yes\")","v":0}]
{"$rows_left_out":30}