{"text_format":"1","workbook":"xlsx","n_sheets":7,"sheets":["Database","Data Update Form","List Choices","Macros Disabled","Checklist","Nitrogen Worksheet","P Worksheet"],"not_rendered":{"charts":0,"images":4,"macros":1,"external_links":0,"defined_names":44,"comments":0,"pivot_tables":0},"unopened":[],"bounds":{"document_bytes":16777216,"sheet_cells":100000,"rows_first":2000,"rows_last":500,"rows_between":2000,"halvings":0,"cell_chars":16384,"cell_head_chars":4096},"cells_cut":0,"cells_raw":0,"read":"whole","date_system":"1900"}

{"sheet":"Database","index":0,"n_rows":174,"n_cols":57,"rows_kept":174,"cut":false,"hidden":true,"merged":[[124,17,124,20],[147,2,147,3],[148,11,148,13],[3,1,3,28],[3,29,3,56],[107,1,107,4],[113,1,113,2],[113,5,113,9],[113,10,113,13],[113,14,113,15],[113,17,113,44]]}
[]
[]
[]
[null,"Database_Low",null,null,null,null,null,null,null,null,null,null,null,null,null,null,null,null,null,null,null,null,null,null,null,null,null,null,null,"Database_High"]
[1,"Crop","Lookup Yield","Row","Alfalfa-Old","Alfalfa-New",null,"Soybeans","Edible beans","peas","Clover/Trefoil","fallow","Grass/legume","Grass/Hay","Pasture","Corn","Wheat","Oats","Potatoes","SugarBeets","Rye","Barley","Buckwheat","Canola","Millet","sorghum","sunflowers","sweet corn","vegetables","Crop","Lookup Yield","Row","Alfalfa-Old","Alfalfa-New",null,"Soybeans","Edible beans","peas","Clover/Trefoil","Fallow","Grass/legume","Grass/Hay","Pasture","Corn","Wheat","Oats","Potatoes","SugarBeets","Rye","Barley","Buckwheat","Canola","Millet","sorghum","sunflowers","sweet corn","vegetables"]
[2]
[3]
[4,"CORN",0,8,{"$f":"'Data Update Form'!$C$7","v":0},{"$f":"'Data Update Form'!$C$9","v":30},null,{"$f":"'Data Update Form'!$C$11","v":100},{"$f":"'Data Update Form'!$C$13","v":125},{"$f":"'Data Update Form'!$C$13","v":125},{"$f":"'Data Update Form'!$C$15","v":70},{"$f":"'Data Update Form'!$C$15","v":70},{"$f":"'Data Update Form'!$C$15","v":70},{"$f":"'Data Update Form'!$C$15","v":70},{"$f":"'Data Update Form'!$C$15","v":70},{"$f":"'Data Update Form'!$C$17","v":145},{"$f":"'Data Update Form'!$C$17","v":145},{"$f":"'Data Update Form'!$C$17","v":145},{"$f":"'Data Update Form'!$C$17","v":145},{"$f":"'Data Update Form'!$C$17","v":145},{"$f":"'Data Update Form'!$C$17","v":145},{"$f":"'Data Update Form'!$C$17","v":145},{"$f":"'Data Update Form'!$C$17","v":145},{"$f":"'Data Update Form'!$C$17","v":145},{"$f":"'Data Update Form'!$C$17","v":145},{"$f":"'Data Update Form'!$C$17","v":145},{"$f":"'Data Update Form'!$C$17","v":145},{"$f":"'Data Update Form'!$C$17","v":145},{"$f":"'Data Update Form'!$C$17","v":145},"CORN",0,8,{"$f":"'Data Update Form'!$C$8","v":0},{"$f":"'Data Update Form'!$C$10","v":30},null,{"$f":"'Data Update Form'!$C$12","v":100},{"$f":"'Data Update Form'!$C$14","v":125},{"$f":"'Data Update Form'!$C$14","v":125},{"$f":"'Data Update Form'!$C$16","v":70},{"$f":"'Data Update Form'!$C$16","v":70},{"$f":"'Data Update Form'!$C$16","v":70},{"$f":"'Data Update Form'!$C$16","v":70},{"$f":"'Data Update Form'!$C$16","v":70},{"$f":"'Data Update Form'!$C$18","v":145},{"$f":"'Data Update Form'!$C$18","v":145},{"$f":"'Data Update Form'!$C$18","v":145},{"$f":"'Data Update Form'!$C$18","v":145},{"$f":"'Data Update Form'!$C$18","v":145},{"$f":"'Data Update Form'!$C$18","v":145},{"$f":"'Data Update Form'!$C$18","v":145},{"$f":"'Data Update Form'!$C$18","v":145},{"$f":"'Data Update Form'!$C$18","v":145},{"$f":"'Data Update Form'!$C$18","v":145},{"$f":"'Data Update Form'!$C$18","v":145},{"$f":"'Data Update Form'!$C$18","v":145},{"$f":"'Data Update Form'!$C$18","v":145},{"$f":"'Data Update Form'!$C$18","v":145}]
[5,"CORN",100,8,{"$f":"'Data Update Form'!$D$7","v":0},{"$f":"'Data Update Form'!$D$9","v":30},null,{"$f":"'Data Update Form'!$D$11","v":100},{"$f":"'Data Update Form'!$D$13","v":125},{"$f":"'Data Update Form'!$D$13","v":125},{"$f":"'Data Update Form'!$D$15","v":70},{"$f":"'Data Update Form'!$D$15","v":70},{"$f":"'Data Update Form'!$D$15","v":70},{"$f":"'Data Update Form'!$D$15","v":70},{"$f":"'Data Update Form'!$D$15","v":70},{"$f":"'Data Update Form'!$D$17","v":145},{"$f":"'Data Update Form'!$D$17","v":145},{"$f":"'Data Update Form'!$D$17","v":145},{"$f":"'Data Update Form'!$D$17","v":145},{"$f":"'Data Update Form'!$D$17","v":145},{"$f":"'Data Update Form'!$D$17","v":145},{"$f":"'Data Update Form'!$D$17","v":145},{"$f":"'Data Update Form'!$D$17","v":145},{"$f":"'Data Update Form'!$D$17","v":145},{"$f":"'Data Update Form'!$D$17","v":145},{"$f":"'Data Update Form'!$D$17","v":145},{"$f":"'Data Update Form'!$D$17","v":145},{"$f":"'Data Update Form'!$D$17","v":145},{"$f":"'Data Update Form'!$D$17","v":145},"CORN",100,8,{"$f":"'Data Update Form'!$D$8","v":0},{"$f":"'Data Update Form'!$D$10","v":30},null,{"$f":"'Data Update Form'!$D$12","v":100},{"$f":"'Data Update Form'!$D$14","v":125},{"$f":"'Data Update Form'!$D$14","v":125},{"$f":"'Data Update Form'!$D$16","v":70},{"$f":"'Data Update Form'!$D$16","v":70},{"$f":"'Data Update Form'!$D$16","v":70},{"$f":"'Data Update Form'!$D$16","v":70},{"$f":"'Data Update Form'!$D$16","v":70},{"$f":"'Data Update Form'!$D$18","v":145},{"$f":"'Data Update Form'!$D$18","v":145},{"$f":"'Data Update Form'!$D$18","v":145},{"$f":"'Data Update Form'!$D$18","v":145},{"$f":"'Data Update Form'!$D$18","v":145},{"$f":"'Data Update Form'!$D$18","v":145},{"$f":"'Data Update Form'!$D$18","v":145},{"$f":"'Data Update Form'!$D$18","v":145},{"$f":"'Data Update Form'!$D$18","v":145},{"$f":"'Data Update Form'!$D$18","v":145},{"$f":"'Data Update Form'!$D$18","v":145},{"$f":"'Data Update Form'!$D$18","v":145},{"$f":"'Data Update Form'!$D$18","v":145},{"$f":"'Data Update Form'!$D$18","v":145}]
[6,"CORN",125,8,{"$f":"'Data Update Form'!$E$7","v":40},{"$f":"'Data Update Form'!$E$9","v":80},null,{"$f":"'Data Update Form'!$E$11","v":150},{"$f":"'Data Update Form'!$E$13","v":175},{"$f":"'Data Update Form'!$E$13","v":175},{"$f":"'Data Update Form'!$E$15","v":120},{"$f":"'Data Update Form'!$E$15","v":120},{"$f":"'Data Update Form'!$E$15","v":120},{"$f":"'Data Update Form'!$E$15","v":120},{"$f":"'Data Update Form'!$E$15","v":120},{"$f":"'Data Update Form'!$E$17","v":195},{"$f":"'Data Update Form'!$E$17","v":195},{"$f":"'Data Update Form'!$E$17","v":195},{"$f":"'Data Update Form'!$E$17","v":195},{"$f":"'Data Update Form'!$E$17","v":195},{"$f":"'Data Update Form'!$E$17","v":195},{"$f":"'Data Update Form'!$E$17","v":195},{"$f":"'Data Update Form'!$E$17","v":195},{"$f":"'Data Update Form'!$E$17","v":195},{"$f":"'Data Update Form'!$E$17","v":195},{"$f":"'Data Update Form'!$E$17","v":195},{"$f":"'Data Update Form'!$E$17","v":195},{"$f":"'Data Update Form'!$E$17","v":195},{"$f":"'Data Update Form'!$E$17","v":195},"CORN",125,8,{"$f":"'Data Update Form'!$E$8","v":40},{"$f":"'Data Update Form'!$E$10","v":80},null,{"$f":"'Data Update Form'!$E$12","v":150},{"$f":"'Data Update Form'!$E$14","v":175},{"$f":"'Data Update Form'!$E$14","v":175},{"$f":"'Data Update Form'!$E$16","v":120},{"$f":"'Data Update Form'!$E$16","v":120},{"$f":"'Data Update Form'!$E$16","v":120},{"$f":"'Data Update Form'!$E$16","v":120},{"$f":"'Data Update Form'!$E$16","v":120},{"$f":"'Data Update Form'!$E$18","v":195},{"$f":"'Data Update Form'!$E$18","v":195},{"$f":"'Data Update Form'!$E$18","v":195},{"$f":"'Data Update Form'!$E$18","v":195},{"$f":"'Data Update Form'!$E$18","v":195},{"$f":"'Data Update Form'!$E$18","v":195},{"$f":"'Data Update Form'!$E$18","v":195},{"$f":"'Data Update Form'!$E$18","v":195},{"$f":"'Data Update Form'!$E$18","v":195},{"$f":"'Data Update Form'!$E$18","v":195},{"$f":"'Data Update Form'!$E$18","v":195},{"$f":"'Data Update Form'!$E$18","v":195},{"$f":"'Data Update Form'!$E$18","v":195},{"$f":"'Data Update Form'!$E$18","v":195}]
[7,"CORN",150,8,{"$f":"'Data Update Form'!$F$7","v":40},{"$f":"'Data Update Form'!$F$9","v":80},null,{"$f":"'Data Update Form'!$F$11","v":150},{"$f":"'Data Update Form'!$F$13","v":175},{"$f":"'Data Update Form'!$F$13","v":175},{"$f":"'Data Update Form'!$F$15","v":120},{"$f":"'Data Update Form'!$F$15","v":120},{"$f":"'Data Update Form'!$F$15","v":120},{"$f":"'Data Update Form'!$F$15","v":120},{"$f":"'Data Update Form'!$F$15","v":120},{"$f":"'Data Update Form'!$F$17","v":195},{"$f":"'Data Update Form'!$F$17","v":195},{"$f":"'Data Update Form'!$F$17","v":195},{"$f":"'Data Update Form'!$F$17","v":195},{"$f":"'Data Update Form'!$F$17","v":195},{"$f":"'Data Update Form'!$F$17","v":195},{"$f":"'Data Update Form'!$F$17","v":195},{"$f":"'Data Update Form'!$F$17","v":195},{"$f":"'Data Update Form'!$F$17","v":195},{"$f":"'Data Update Form'!$F$17","v":195},{"$f":"'Data Update Form'!$F$17","v":195},{"$f":"'Data Update Form'!$F$17","v":195},{"$f":"'Data Update Form'!$F$17","v":195},{"$f":"'Data Update Form'!$F$17","v":195},"CORN",150,8,{"$f":"'Data Update Form'!$F$8","v":40},{"$f":"'Data Update Form'!$F$10","v":80},null,{"$f":"'Data Update Form'!$F$12","v":150},{"$f":"'Data Update Form'!$F$14","v":175},{"$f":"'Data Update Form'!$F$14","v":175},{"$f":"'Data Update Form'!$F$16","v":120},{"$f":"'Data Update Form'!$F$16","v":120},{"$f":"'Data Update Form'!$F$16","v":120},{"$f":"'Data Update Form'!$F$16","v":120},{"$f":"'Data Update Form'!$F$16","v":120},{"$f":"'Data Update Form'!$F$18","v":195},{"$f":"'Data Update Form'!$F$18","v":195},{"$f":"'Data Update Form'!$F$18","v":195},{"$f":"'Data Update Form'!$F$18","v":195},{"$f":"'Data Update Form'!$F$18","v":195},{"$f":"'Data Update Form'!$F$18","v":195},{"$f":"'Data Update Form'!$F$18","v":195},{"$f":"'Data Update Form'!$F$18","v":195},{"$f":"'Data Update Form'!$F$18","v":195},{"$f":"'Data Update Form'!$F$18","v":195},{"$f":"'Data Update Form'!$F$18","v":195},{"$f":"'Data Update Form'!$F$18","v":195},{"$f":"'Data Update Form'!$F$18","v":195},{"$f":"'Data Update Form'!$F$18","v":195}]
[8,"CORN",175,8,{"$f":"'Data Update Form'!$G$7","v":40},{"$f":"'Data Update Form'!$G$9","v":80},null,{"$f":"'Data Update Form'!$G$11","v":150},{"$f":"'Data Update Form'!$G$13","v":175},{"$f":"'Data Update Form'!$G$13","v":175},{"$f":"'Data Update Form'!$G$15","v":120},{"$f":"'Data Update Form'!$G$15","v":120},{"$f":"'Data Update Form'!$G$15","v":120},{"$f":"'Data Update Form'!$G$15","v":120},{"$f":"'Data Update Form'!$G$15","v":120},{"$f":"'Data Update Form'!$G$17","v":195},{"$f":"'Data Update Form'!$G$17","v":195},{"$f":"'Data Update Form'!$G$17","v":195},{"$f":"'Data Update Form'!$G$17","v":195},{"$f":"'Data Update Form'!$G$17","v":195},{"$f":"'Data Update Form'!$G$17","v":195},{"$f":"'Data Update Form'!$G$17","v":195},{"$f":"'Data Update Form'!$G$17","v":195},{"$f":"'Data Update Form'!$G$17","v":195},{"$f":"'Data Update Form'!$G$17","v":195},{"$f":"'Data Update Form'!$G$17","v":195},{"$f":"'Data Update Form'!$G$17","v":195},{"$f":"'Data Update Form'!$G$17","v":195},{"$f":"'Data Update Form'!$G$17","v":195},"CORN",175,8,{"$f":"'Data Update Form'!$G$8","v":40},{"$f":"'Data Update Form'!$G$10","v":80},null,{"$f":"'Data Update Form'!$G$12","v":150},{"$f":"'Data Update Form'!$G$14","v":175},{"$f":"'Data Update Form'!$G$14","v":175},{"$f":"'Data Update Form'!$G$16","v":120},{"$f":"'Data Update Form'!$G$16","v":120},{"$f":"'Data Update Form'!$G$16","v":120},{"$f":"'Data Update Form'!$G$16","v":120},{"$f":"'Data Update Form'!$G$16","v":120},{"$f":"'Data Update Form'!$G$18","v":195},{"$f":"'Data Update Form'!$G$18","v":195},{"$f":"'Data Update Form'!$G$18","v":195},{"$f":"'Data Update Form'!$G$18","v":195},{"$f":"'Data Update Form'!$G$18","v":195},{"$f":"'Data Update Form'!$G$18","v":195},{"$f":"'Data Update Form'!$G$18","v":195},{"$f":"'Data Update Form'!$G$18","v":195},{"$f":"'Data Update Form'!$G$18","v":195},{"$f":"'Data Update Form'!$G$18","v":195},{"$f":"'Data Update Form'!$G$18","v":195},{"$f":"'Data Update Form'!$G$18","v":195},{"$f":"'Data Update Form'!$G$18","v":195},{"$f":"'Data Update Form'!$G$18","v":195}]
[9,"CORN",200,8,{"$f":"'Data Update Form'!$H$7","v":40},{"$f":"'Data Update Form'!$H$9","v":80},null,{"$f":"'Data Update Form'!$H$11","v":150},{"$f":"'Data Update Form'!$H$13","v":175},{"$f":"'Data Update Form'!$H$13","v":175},{"$f":"'Data Update Form'!$H$15","v":120},{"$f":"'Data Update Form'!$H$15","v":120},{"$f":"'Data Update Form'!$H$15","v":120},{"$f":"'Data Update Form'!$H$15","v":120},{"$f":"'Data Update Form'!$H$15","v":120},{"$f":"'Data Update Form'!$H$17","v":195},{"$f":"'Data Update Form'!$H$17","v":195},{"$f":"'Data Update Form'!$H$17","v":195},{"$f":"'Data Update Form'!$H$17","v":195},{"$f":"'Data Update Form'!$H$17","v":195},{"$f":"'Data Update Form'!$H$17","v":195},{"$f":"'Data Update Form'!$H$17","v":195},{"$f":"'Data Update Form'!$H$17","v":195},{"$f":"'Data Update Form'!$H$17","v":195},{"$f":"'Data Update Form'!$H$17","v":195},{"$f":"'Data Update Form'!$H$17","v":195},{"$f":"'Data Update Form'!$H$17","v":195},{"$f":"'Data Update Form'!$H$17","v":195},{"$f":"'Data Update Form'!$H$17","v":195},"CORN",200,8,{"$f":"'Data Update Form'!$H$8","v":40},{"$f":"'Data Update Form'!$H$10","v":80},null,{"$f":"'Data Update Form'!$H$12","v":150},{"$f":"'Data Update Form'!$H$14","v":175},{"$f":"'Data Update Form'!$H$14","v":175},{"$f":"'Data Update Form'!$H$16","v":120},{"$f":"'Data Update Form'!$H$16","v":120},{"$f":"'Data Update Form'!$H$16","v":120},{"$f":"'Data Update Form'!$H$16","v":120},{"$f":"'Data Update Form'!$H$16","v":120},{"$f":"'Data Update Form'!$H$18","v":195},{"$f":"'Data Update Form'!$H$18","v":195},{"$f":"'Data Update Form'!$H$18","v":195},{"$f":"'Data Update Form'!$H$18","v":195},{"$f":"'Data Update Form'!$H$18","v":195},{"$f":"'Data Update Form'!$H$18","v":195},{"$f":"'Data Update Form'!$H$18","v":195},{"$f":"'Data Update Form'!$H$18","v":195},{"$f":"'Data Update Form'!$H$18","v":195},{"$f":"'Data Update Form'!$H$18","v":195},{"$f":"'Data Update Form'!$H$18","v":195},{"$f":"'Data Update Form'!$H$18","v":195},{"$f":"'Data Update Form'!$H$18","v":195},{"$f":"'Data Update Form'!$H$18","v":195}]
[10]
[11,"WHEAT",0,25,{"$f":"'Data Update Form'!$C$31","v":0},{"$f":"'Data Update Form'!$C$33","v":30},null,{"$f":"'Data Update Form'!$C$35","v":60},{"$f":"'Data Update Form'!$C$37","v":70},{"$f":"'Data Update Form'!$C$37","v":70},{"$f":"'Data Update Form'!$C$39","v":30},{"$f":"'Data Update Form'!$C$39","v":30},{"$f":"'Data Update Form'!$C$39","v":30},{"$f":"'Data Update Form'!$C$39","v":30},{"$f":"'Data Update Form'!$C$39","v":30},{"$f":"'Data Update Form'!$C$41","v":80},{"$f":"'Data Update Form'!$C$41","v":80},{"$f":"'Data Update Form'!$C$41","v":80},{"$f":"'Data Update Form'!$C$41","v":80},{"$f":"'Data Update Form'!$C$41","v":80},{"$f":"'Data Update Form'!$C$41","v":80},{"$f":"'Data Update Form'!$C$41","v":80},{"$f":"'Data Update Form'!$C$41","v":80},{"$f":"'Data Update Form'!$C$41","v":80},{"$f":"'Data Update Form'!$C$41","v":80},{"$f":"'Data Update Form'!$C$41","v":80},{"$f":"'Data Update Form'!$C$41","v":80},{"$f":"'Data Update Form'!$C$41","v":80},{"$f":"'Data Update Form'!$C$41","v":80},"WHEAT",0,25,{"$f":"'Data Update Form'!$C$32","v":0},{"$f":"'Data Update Form'!$C$34","v":0},null,{"$f":"'Data Update Form'!$C$36","v":40},{"$f":"'Data Update Form'!$C$38","v":50},{"$f":"'Data Update Form'!$C$38","v":50},{"$f":"'Data Update Form'!$C$40","v":0},{"$f":"'Data Update Form'!$C$40","v":0},{"$f":"'Data Update Form'!$C$40","v":0},{"$f":"'Data Update Form'!$C$40","v":0},{"$f":"'Data Update Form'!$C$40","v":0},{"$f":"'Data Update Form'!$C$42","v":60},{"$f":"'Data Update Form'!$C$42","v":60},{"$f":"'Data Update Form'!$C$42","v":60},{"$f":"'Data Update Form'!$C$42","v":60},{"$f":"'Data Update Form'!$C$42","v":60},{"$f":"'Data Update Form'!$C$42","v":60},{"$f":"'Data Update Form'!$C$42","v":60},{"$f":"'Data Update Form'!$C$42","v":60},{"$f":"'Data Update Form'!$C$42","v":60},{"$f":"'Data Update Form'!$C$42","v":60},{"$f":"'Data Update Form'!$C$42","v":60},{"$f":"'Data Update Form'!$C$42","v":60},{"$f":"'Data Update Form'!$C$42","v":60},{"$f":"'Data Update Form'!$C$42","v":60}]
[12,"WHEAT",50,25,{"$f":"'Data Update Form'!$D$31","v":30},{"$f":"'Data Update Form'!$D$33","v":55},null,{"$f":"'Data Update Form'!$D$35","v":85},{"$f":"'Data Update Form'!$D$37","v":95},{"$f":"'Data Update Form'!$D$37","v":95},{"$f":"'Data Update Form'!$D$39","v":55},{"$f":"'Data Update Form'!$D$39","v":55},{"$f":"'Data Update Form'!$D$39","v":55},{"$f":"'Data Update Form'!$D$39","v":55},{"$f":"'Data Update Form'!$D$39","v":55},{"$f":"'Data Update Form'!$D$41","v":105},{"$f":"'Data Update Form'!$D$41","v":105},{"$f":"'Data Update Form'!$D$41","v":105},{"$f":"'Data Update Form'!$D$41","v":105},{"$f":"'Data Update Form'!$D$41","v":105},{"$f":"'Data Update Form'!$D$41","v":105},{"$f":"'Data Update Form'!$D$41","v":105},{"$f":"'Data Update Form'!$D$41","v":105},{"$f":"'Data Update Form'!$D$41","v":105},{"$f":"'Data Update Form'!$D$41","v":105},{"$f":"'Data Update Form'!$D$41","v":105},{"$f":"'Data Update Form'!$D$41","v":105},{"$f":"'Data Update Form'!$D$41","v":105},{"$f":"'Data Update Form'!$D$41","v":105},"WHEAT",50,25,{"$f":"'Data Update Form'!$D$32","v":0},{"$f":"'Data Update Form'!$D$34","v":35},null,{"$f":"'Data Update Form'!$D$36","v":65},{"$f":"'Data Update Form'!$D$38","v":75},{"$f":"'Data Update Form'!$D$38","v":75},{"$f":"'Data Update Form'!$D$40","v":35},{"$f":"'Data Update Form'!$D$40","v":35},{"$f":"'Data Update Form'!$D$40","v":35},{"$f":"'Data Update Form'!$D$40","v":35},{"$f":"'Data Update Form'!$D$40","v":35},{"$f":"'Data Update Form'!$D$42","v":85},{"$f":"'Data Update Form'!$D$42","v":85},{"$f":"'Data Update Form'!$D$42","v":85},{"$f":"'Data Update Form'!$D$42","v":85},{"$f":"'Data Update Form'!$D$42","v":85},{"$f":"'Data Update Form'!$D$42","v":85},{"$f":"'Data Update Form'!$D$42","v":85},{"$f":"'Data Update Form'!$D$42","v":85},{"$f":"'Data Update Form'!$D$42","v":85},{"$f":"'Data Update Form'!$D$42","v":85},{"$f":"'Data Update Form'!$D$42","v":85},{"$f":"'Data Update Form'!$D$42","v":85},{"$f":"'Data Update Form'!$D$42","v":85},{"$f":"'Data Update Form'!$D$42","v":85}]
[13,"WHEAT",60,25,{"$f":"'Data Update Form'!$E$31","v":55},{"$f":"'Data Update Form'!$E$33","v":80},null,{"$f":"'Data Update Form'!$E$35","v":110},{"$f":"'Data Update Form'!$E$37","v":120},{"$f":"'Data Update Form'!$E$37","v":120},{"$f":"'Data Update Form'!$E$39","v":80},{"$f":"'Data Update Form'!$E$39","v":80},{"$f":"'Data Update Form'!$E$39","v":80},{"$f":"'Data Update Form'!$E$39","v":80},{"$f":"'Data Update Form'!$E$39","v":80},{"$f":"'Data Update Form'!$E$41","v":130},{"$f":"'Data Update Form'!$E$41","v":130},{"$f":"'Data Update Form'!$E$41","v":130},{"$f":"'Data Update Form'!$E$41","v":130},{"$f":"'Data Update Form'!$E$41","v":130},{"$f":"'Data Update Form'!$E$41","v":130},{"$f":"'Data Update Form'!$E$41","v":130},{"$f":"'Data Update Form'!$E$41","v":130},{"$f":"'Data Update Form'!$E$41","v":130},{"$f":"'Data Update Form'!$E$41","v":130},{"$f":"'Data Update Form'!$E$41","v":130},{"$f":"'Data Update Form'!$E$41","v":130},{"$f":"'Data Update Form'!$E$41","v":130},{"$f":"'Data Update Form'!$E$41","v":130},"WHEAT",60,25,{"$f":"'Data Update Form'!$E$32","v":35},{"$f":"'Data Update Form'!$E$34","v":60},null,{"$f":"'Data Update Form'!$E$36","v":90},{"$f":"'Data Update Form'!$E$38","v":100},{"$f":"'Data Update Form'!$E$38","v":100},{"$f":"'Data Update Form'!$E$40","v":60},{"$f":"'Data Update Form'!$E$40","v":60},{"$f":"'Data Update Form'!$E$40","v":60},{"$f":"'Data Update Form'!$E$40","v":60},{"$f":"'Data Update Form'!$E$40","v":60},{"$f":"'Data Update Form'!$E$42","v":110},{"$f":"'Data Update Form'!$E$42","v":110},{"$f":"'Data Update Form'!$E$42","v":110},{"$f":"'Data Update Form'!$E$42","v":110},{"$f":"'Data Update Form'!$E$42","v":110},{"$f":"'Data Update Form'!$E$42","v":110},{"$f":"'Data Update Form'!$E$42","v":110},{"$f":"'Data Update Form'!$E$42","v":110},{"$f":"'Data Update Form'!$E$42","v":110},{"$f":"'Data Update Form'!$E$42","v":110},{"$f":"'Data Update Form'!$E$42","v":110},{"$f":"'Data Update Form'!$E$42","v":110},{"$f":"'Data Update Form'!$E$42","v":110},{"$f":"'Data Update Form'!$E$42","v":110}]
[14,"WHEAT",70,25,{"$f":"'Data Update Form'!$F$31","v":80},{"$f":"'Data Update Form'!$F$33","v":105},null,{"$f":"'Data Update Form'!$F$35","v":135},{"$f":"'Data Update Form'!$F$37","v":145},{"$f":"'Data Update Form'!$F$37","v":145},{"$f":"'Data Update Form'!$F$39","v":105},{"$f":"'Data Update Form'!$F$39","v":105},{"$f":"'Data Update Form'!$F$39","v":105},{"$f":"'Data Update Form'!$F$39","v":105},{"$f":"'Data Update Form'!$F$39","v":105},{"$f":"'Data Update Form'!$F$41","v":155},{"$f":"'Data Update Form'!$F$41","v":155},{"$f":"'Data Update Form'!$F$41","v":155},{"$f":"'Data Update Form'!$F$41","v":155},{"$f":"'Data Update Form'!$F$41","v":155},{"$f":"'Data Update Form'!$F$41","v":155},{"$f":"'Data Update Form'!$F$41","v":155},{"$f":"'Data Update Form'!$F$41","v":155},{"$f":"'Data Update Form'!$F$41","v":155},{"$f":"'Data Update Form'!$F$41","v":155},{"$f":"'Data Update Form'!$F$41","v":155},{"$f":"'Data Update Form'!$F$41","v":155},{"$f":"'Data Update Form'!$F$41","v":155},{"$f":"'Data Update Form'!$F$41","v":155},"WHEAT",70,25,{"$f":"'Data Update Form'!$F$32","v":60},{"$f":"'Data Update Form'!$F$34","v":85},null,{"$f":"'Data Update Form'!$F$36","v":115},{"$f":"'Data Update Form'!$F$38","v":125},{"$f":"'Data Update Form'!$F$38","v":125},{"$f":"'Data Update Form'!$F$40","v":85},{"$f":"'Data Update Form'!$F$40","v":85},{"$f":"'Data Update Form'!$F$40","v":85},{"$f":"'Data Update Form'!$F$40","v":85},{"$f":"'Data Update Form'!$F$40","v":85},{"$f":"'Data Update Form'!$F$42","v":135},{"$f":"'Data Update Form'!$F$42","v":135},{"$f":"'Data Update Form'!$F$42","v":135},{"$f":"'Data Update Form'!$F$42","v":135},{"$f":"'Data Update Form'!$F$42","v":135},{"$f":"'Data Update Form'!$F$42","v":135},{"$f":"'Data Update Form'!$F$42","v":135},{"$f":"'Data Update Form'!$F$42","v":135},{"$f":"'Data Update Form'!$F$42","v":135},{"$f":"'Data Update Form'!$F$42","v":135},{"$f":"'Data Update Form'!$F$42","v":135},{"$f":"'Data Update Form'!$F$42","v":135},{"$f":"'Data Update Form'!$F$42","v":135},{"$f":"'Data Update Form'!$F$42","v":135}]
[15,"WHEAT",80,25,{"$f":"'Data Update Form'!$G$31","v":95},{"$f":"'Data Update Form'!$G$33","v":120},null,{"$f":"'Data Update Form'!$G$35","v":150},{"$f":"'Data Update Form'!$G$37","v":160},{"$f":"'Data Update Form'!$G$37","v":160},{"$f":"'Data Update Form'!$G$39","v":120},{"$f":"'Data Update Form'!$G$39","v":120},{"$f":"'Data Update Form'!$G$39","v":120},{"$f":"'Data Update Form'!$G$39","v":120},{"$f":"'Data Update Form'!$G$39","v":120},{"$f":"'Data Update Form'!$G$41","v":170},{"$f":"'Data Update Form'!$G$41","v":170},{"$f":"'Data Update Form'!$G$41","v":170},{"$f":"'Data Update Form'!$G$41","v":170},{"$f":"'Data Update Form'!$G$41","v":170},{"$f":"'Data Update Form'!$G$41","v":170},{"$f":"'Data Update Form'!$G$41","v":170},{"$f":"'Data Update Form'!$G$41","v":170},{"$f":"'Data Update Form'!$G$41","v":170},{"$f":"'Data Update Form'!$G$41","v":170},{"$f":"'Data Update Form'!$G$41","v":170},{"$f":"'Data Update Form'!$G$41","v":170},{"$f":"'Data Update Form'!$G$41","v":170},{"$f":"'Data Update Form'!$G$41","v":170},"WHEAT",80,25,{"$f":"'Data Update Form'!$G$32","v":75},{"$f":"'Data Update Form'!$G$34","v":100},null,{"$f":"'Data Update Form'!$G$36","v":130},{"$f":"'Data Update Form'!$G$38","v":140},{"$f":"'Data Update Form'!$G$38","v":140},{"$f":"'Data Update Form'!$G$40","v":100},{"$f":"'Data Update Form'!$G$40","v":100},{"$f":"'Data Update Form'!$G$40","v":100},{"$f":"'Data Update Form'!$G$40","v":100},{"$f":"'Data Update Form'!$G$40","v":100},{"$f":"'Data Update Form'!$G$42","v":150},{"$f":"'Data Update Form'!$G$42","v":150},{"$f":"'Data Update Form'!$G$42","v":150},{"$f":"'Data Update Form'!$G$42","v":150},{"$f":"'Data Update Form'!$G$42","v":150},{"$f":"'Data Update Form'!$G$42","v":150},{"$f":"'Data Update Form'!$G$42","v":150},{"$f":"'Data Update Form'!$G$42","v":150},{"$f":"'Data Update Form'!$G$42","v":150},{"$f":"'Data Update Form'!$G$42","v":150},{"$f":"'Data Update Form'!$G$42","v":150},{"$f":"'Data Update Form'!$G$42","v":150},{"$f":"'Data Update Form'!$G$42","v":150},{"$f":"'Data Update Form'!$G$42","v":150}]
[16]
[17,"BARLEY",0,4,{"$f":"'Data Update Form'!$C$51","v":0},{"$f":"'Data Update Form'!$C$53","v":30},null,{"$f":"'Data Update Form'!$C$55","v":30},{"$f":"'Data Update Form'!$C$57","v":40},{"$f":"'Data Update Form'!$C$57","v":40},{"$f":"'Data Update Form'!$C$59","v":0},{"$f":"'Data Update Form'!$C$59","v":0},{"$f":"'Data Update Form'!$C$59","v":0},{"$f":"'Data Update Form'!$C$59","v":0},{"$f":"'Data Update Form'!$C$59","v":0},{"$f":"'Data Update Form'!$C$61","v":50},{"$f":"'Data Update Form'!$C$61","v":50},{"$f":"'Data Update Form'!$C$61","v":50},{"$f":"'Data Update Form'!$C$61","v":50},{"$f":"'Data Update Form'!$C$61","v":50},{"$f":"'Data Update Form'!$C$61","v":50},{"$f":"'Data Update Form'!$C$61","v":50},{"$f":"'Data Update Form'!$C$61","v":50},{"$f":"'Data Update Form'!$C$61","v":50},{"$f":"'Data Update Form'!$C$61","v":50},{"$f":"'Data Update Form'!$C$61","v":50},{"$f":"'Data Update Form'!$C$61","v":50},{"$f":"'Data Update Form'!$C$61","v":50},{"$f":"'Data Update Form'!$C$61","v":50},"BARLEY",0,4,{"$f":"'Data Update Form'!$C$52","v":0},{"$f":"'Data Update Form'!$C$54","v":0},null,{"$f":"'Data Update Form'!$C$56","v":0},{"$f":"'Data Update Form'!$C$58","v":0},{"$f":"'Data Update Form'!$C$58","v":0},{"$f":"'Data Update Form'!$C$60","v":0},{"$f":"'Data Update Form'!$C$60","v":0},{"$f":"'Data Update Form'!$C$60","v":0},{"$f":"'Data Update Form'!$C$60","v":0},{"$f":"'Data Update Form'!$C$60","v":0},{"$f":"'Data Update Form'!$C$62","v":30},{"$f":"'Data Update Form'!$C$62","v":30},{"$f":"'Data Update Form'!$C$62","v":30},{"$f":"'Data Update Form'!$C$62","v":30},{"$f":"'Data Update Form'!$C$62","v":30},{"$f":"'Data Update Form'!$C$62","v":30},{"$f":"'Data Update Form'!$C$62","v":30},{"$f":"'Data Update Form'!$C$62","v":30},{"$f":"'Data Update Form'!$C$62","v":30},{"$f":"'Data Update Form'!$C$62","v":30},{"$f":"'Data Update Form'!$C$62","v":30},{"$f":"'Data Update Form'!$C$62","v":30},{"$f":"'Data Update Form'!$C$62","v":30},{"$f":"'Data Update Form'!$C$62","v":30}]
[18,"BARLEY",50,4,{"$f":"'Data Update Form'!$D$51","v":0},{"$f":"'Data Update Form'!$D$53","v":50},null,{"$f":"'Data Update Form'!$D$55","v":50},{"$f":"'Data Update Form'!$D$57","v":60},{"$f":"'Data Update Form'!$D$57","v":60},{"$f":"'Data Update Form'!$D$59","v":20},{"$f":"'Data Update Form'!$D$59","v":20},{"$f":"'Data Update Form'!$D$59","v":20},{"$f":"'Data Update Form'!$D$59","v":20},{"$f":"'Data Update Form'!$D$59","v":20},{"$f":"'Data Update Form'!$D$61","v":70},{"$f":"'Data Update Form'!$D$61","v":70},{"$f":"'Data Update Form'!$D$61","v":70},{"$f":"'Data Update Form'!$D$61","v":70},{"$f":"'Data Update Form'!$D$61","v":70},{"$f":"'Data Update Form'!$D$61","v":70},{"$f":"'Data Update Form'!$D$61","v":70},{"$f":"'Data Update Form'!$D$61","v":70},{"$f":"'Data Update Form'!$D$61","v":70},{"$f":"'Data Update Form'!$D$61","v":70},{"$f":"'Data Update Form'!$D$61","v":70},{"$f":"'Data Update Form'!$D$61","v":70},{"$f":"'Data Update Form'!$D$61","v":70},{"$f":"'Data Update Form'!$D$61","v":70},"BARLEY",50,4,{"$f":"'Data Update Form'!$D$52","v":0},{"$f":"'Data Update Form'!$D$54","v":30},null,{"$f":"'Data Update Form'!$D$56","v":30},{"$f":"'Data Update Form'!$D$58","v":40},{"$f":"'Data Update Form'!$D$58","v":40},{"$f":"'Data Update Form'!$D$60","v":0},{"$f":"'Data Update Form'!$D$60","v":0},{"$f":"'Data Update Form'!$D$60","v":0},{"$f":"'Data Update Form'!$D$60","v":0},{"$f":"'Data Update Form'!$D$60","v":0},{"$f":"'Data Update Form'!$D$62","v":50},{"$f":"'Data Update Form'!$D$62","v":50},{"$f":"'Data Update Form'!$D$62","v":50},{"$f":"'Data Update Form'!$D$62","v":50},{"$f":"'Data Update Form'!$D$62","v":50},{"$f":"'Data Update Form'!$D$62","v":50},{"$f":"'Data Update Form'!$D$62","v":50},{"$f":"'Data Update Form'!$D$62","v":50},{"$f":"'Data Update Form'!$D$62","v":50},{"$f":"'Data Update Form'!$D$62","v":50},{"$f":"'Data Update Form'!$D$62","v":50},{"$f":"'Data Update Form'!$D$62","v":50},{"$f":"'Data Update Form'!$D$62","v":50},{"$f":"'Data Update Form'!$D$62","v":50}]
[19,"BARLEY",60,4,{"$f":"'Data Update Form'!$E$51","v":15},{"$f":"'Data Update Form'!$E$53","v":65},null,{"$f":"'Data Update Form'!$E$55","v":65},{"$f":"'Data Update Form'!$E$57","v":75},{"$f":"'Data Update Form'!$E$57","v":75},{"$f":"'Data Update Form'!$E$59","v":35},{"$f":"'Data Update Form'!$E$59","v":35},{"$f":"'Data Update Form'!$E$59","v":35},{"$f":"'Data Update Form'!$E$59","v":35},{"$f":"'Data Update Form'!$E$59","v":35},{"$f":"'Data Update Form'!$E$61","v":85},{"$f":"'Data Update Form'!$E$61","v":85},{"$f":"'Data Update Form'!$E$61","v":85},{"$f":"'Data Update Form'!$E$61","v":85},{"$f":"'Data Update Form'!$E$61","v":85},{"$f":"'Data Update Form'!$E$61","v":85},{"$f":"'Data Update Form'!$E$61","v":85},{"$f":"'Data Update Form'!$E$61","v":85},{"$f":"'Data Update Form'!$E$61","v":85},{"$f":"'Data Update Form'!$E$61","v":85},{"$f":"'Data Update Form'!$E$61","v":85},{"$f":"'Data Update Form'!$E$61","v":85},{"$f":"'Data Update Form'!$E$61","v":85},{"$f":"'Data Update Form'!$E$61","v":85},"BARLEY",60,4,{"$f":"'Data Update Form'!$E$52","v":0},{"$f":"'Data Update Form'!$E$54","v":45},null,{"$f":"'Data Update Form'!$E$56","v":45},{"$f":"'Data Update Form'!$E$58","v":55},{"$f":"'Data Update Form'!$E$58","v":55},{"$f":"'Data Update Form'!$E$60","v":15},{"$f":"'Data Update Form'!$E$60","v":15},{"$f":"'Data Update Form'!$E$60","v":15},{"$f":"'Data Update Form'!$E$60","v":15},{"$f":"'Data Update Form'!$E$60","v":15},{"$f":"'Data Update Form'!$E$62","v":65},{"$f":"'Data Update Form'!$E$62","v":65},{"$f":"'Data Update Form'!$E$62","v":65},{"$f":"'Data Update Form'!$E$62","v":65},{"$f":"'Data Update Form'!$E$62","v":65},{"$f":"'Data Update Form'!$E$62","v":65},{"$f":"'Data Update Form'!$E$62","v":65},{"$f":"'Data Update Form'!$E$62","v":65},{"$f":"'Data Update Form'!$E$62","v":65},{"$f":"'Data Update Form'!$E$62","v":65},{"$f":"'Data Update Form'!$E$62","v":65},{"$f":"'Data Update Form'!$E$62","v":65},{"$f":"'Data Update Form'!$E$62","v":65},{"$f":"'Data Update Form'!$E$62","v":65}]
[20,"BARLEY",70,4,{"$f":"'Data Update Form'!$F$51","v":30},{"$f":"'Data Update Form'!$F$53","v":80},null,{"$f":"'Data Update Form'!$F$55","v":80},{"$f":"'Data Update Form'!$F$57","v":90},{"$f":"'Data Update Form'!$F$57","v":90},{"$f":"'Data Update Form'!$F$59","v":50},{"$f":"'Data Update Form'!$F$59","v":50},{"$f":"'Data Update Form'!$F$59","v":50},{"$f":"'Data Update Form'!$F$59","v":50},{"$f":"'Data Update Form'!$F$59","v":50},{"$f":"'Data Update Form'!$F$61","v":100},{"$f":"'Data Update Form'!$F$61","v":100},{"$f":"'Data Update Form'!$F$61","v":100},{"$f":"'Data Update Form'!$F$61","v":100},{"$f":"'Data Update Form'!$F$61","v":100},{"$f":"'Data Update Form'!$F$61","v":100},{"$f":"'Data Update Form'!$F$61","v":100},{"$f":"'Data Update Form'!$F$61","v":100},{"$f":"'Data Update Form'!$F$61","v":100},{"$f":"'Data Update Form'!$F$61","v":100},{"$f":"'Data Update Form'!$F$61","v":100},{"$f":"'Data Update Form'!$F$61","v":100},{"$f":"'Data Update Form'!$F$61","v":100},{"$f":"'Data Update Form'!$F$61","v":100},"BARLEY",70,4,{"$f":"'Data Update Form'!$F$52","v":10},{"$f":"'Data Update Form'!$F$54","v":60},null,{"$f":"'Data Update Form'!$F$56","v":60},{"$f":"'Data Update Form'!$F$58","v":70},{"$f":"'Data Update Form'!$F$58","v":70},{"$f":"'Data Update Form'!$F$60","v":30},{"$f":"'Data Update Form'!$F$60","v":30},{"$f":"'Data Update Form'!$F$60","v":30},{"$f":"'Data Update Form'!$F$60","v":30},{"$f":"'Data Update Form'!$F$60","v":30},{"$f":"'Data Update Form'!$F$62","v":80},{"$f":"'Data Update Form'!$F$62","v":80},{"$f":"'Data Update Form'!$F$62","v":80},{"$f":"'Data Update Form'!$F$62","v":80},{"$f":"'Data Update Form'!$F$62","v":80},{"$f":"'Data Update Form'!$F$62","v":80},{"$f":"'Data Update Form'!$F$62","v":80},{"$f":"'Data Update Form'!$F$62","v":80},{"$f":"'Data Update Form'!$F$62","v":80},{"$f":"'Data Update Form'!$F$62","v":80},{"$f":"'Data Update Form'!$F$62","v":80},{"$f":"'Data Update Form'!$F$62","v":80},{"$f":"'Data Update Form'!$F$62","v":80},{"$f":"'Data Update Form'!$F$62","v":80}]
[21,"BARLEY",80,4,{"$f":"'Data Update Form'!$G$51","v":45},{"$f":"'Data Update Form'!$G$53","v":95},null,{"$f":"'Data Update Form'!$G$55","v":95},{"$f":"'Data Update Form'!$G$57","v":105},{"$f":"'Data Update Form'!$G$57","v":105},{"$f":"'Data Update Form'!$G$59","v":65},{"$f":"'Data Update Form'!$G$59","v":65},{"$f":"'Data Update Form'!$G$59","v":65},{"$f":"'Data Update Form'!$G$59","v":65},{"$f":"'Data Update Form'!$G$59","v":65},{"$f":"'Data Update Form'!$G$61","v":115},{"$f":"'Data Update Form'!$G$61","v":115},{"$f":"'Data Update Form'!$G$61","v":115},{"$f":"'Data Update Form'!$G$61","v":115},{"$f":"'Data Update Form'!$G$61","v":115},{"$f":"'Data Update Form'!$G$61","v":115},{"$f":"'Data Update Form'!$G$61","v":115},{"$f":"'Data Update Form'!$G$61","v":115},{"$f":"'Data Update Form'!$G$61","v":115},{"$f":"'Data Update Form'!$G$61","v":115},{"$f":"'Data Update Form'!$G$61","v":115},{"$f":"'Data Update Form'!$G$61","v":115},{"$f":"'Data Update Form'!$G$61","v":115},{"$f":"'Data Update Form'!$G$61","v":115},"BARLEY",80,4,{"$f":"'Data Update Form'!$G$52","v":25},{"$f":"'Data Update Form'!$G$54","v":75},null,{"$f":"'Data Update Form'!$G$56","v":75},{"$f":"'Data Update Form'!$G$58","v":85},{"$f":"'Data Update Form'!$G$58","v":85},{"$f":"'Data Update Form'!$G$60","v":45},{"$f":"'Data Update Form'!$G$60","v":45},{"$f":"'Data Update Form'!$G$60","v":45},{"$f":"'Data Update Form'!$G$60","v":45},{"$f":"'Data Update Form'!$G$60","v":45},{"$f":"'Data Update Form'!$G$62","v":95},{"$f":"'Data Update Form'!$G$62","v":95},{"$f":"'Data Update Form'!$G$62","v":95},{"$f":"'Data Update Form'!$G$62","v":95},{"$f":"'Data Update Form'!$G$62","v":95},{"$f":"'Data Update Form'!$G$62","v":95},{"$f":"'Data Update Form'!$G$62","v":95},{"$f":"'Data Update Form'!$G$62","v":95},{"$f":"'Data Update Form'!$G$62","v":95},{"$f":"'Data Update Form'!$G$62","v":95},{"$f":"'Data Update Form'!$G$62","v":95},{"$f":"'Data Update Form'!$G$62","v":95},{"$f":"'Data Update Form'!$G$62","v":95},{"$f":"'Data Update Form'!$G$62","v":95}]
[22,"BARLEY",90,4,{"$f":"'Data Update Form'!$H$51","v":60},{"$f":"'Data Update Form'!$H$53","v":110},null,{"$f":"'Data Update Form'!$H$55","v":110},{"$f":"'Data Update Form'!$H$57","v":120},{"$f":"'Data Update Form'!$H$57","v":120},{"$f":"'Data Update Form'!$H$59","v":80},{"$f":"'Data Update Form'!$H$59","v":80},{"$f":"'Data Update Form'!$H$59","v":80},{"$f":"'Data Update Form'!$H$59","v":80},{"$f":"'Data Update Form'!$H$59","v":80},{"$f":"'Data Update Form'!$H$61","v":130},{"$f":"'Data Update Form'!$H$61","v":130},{"$f":"'Data Update Form'!$H$61","v":130},{"$f":"'Data Update Form'!$H$61","v":130},{"$f":"'Data Update Form'!$H$61","v":130},{"$f":"'Data Update Form'!$H$61","v":130},{"$f":"'Data Update Form'!$H$61","v":130},{"$f":"'Data Update Form'!$H$61","v":130},{"$f":"'Data Update Form'!$H$61","v":130},{"$f":"'Data Update Form'!$H$61","v":130},{"$f":"'Data Update Form'!$H$61","v":130},{"$f":"'Data Update Form'!$H$61","v":130},{"$f":"'Data Update Form'!$H$61","v":130},{"$f":"'Data Update Form'!$H$61","v":130},"BARLEY",90,4,{"$f":"'Data Update Form'!$H$52","v":40},{"$f":"'Data Update Form'!$H$54","v":90},null,{"$f":"'Data Update Form'!$H$56","v":90},{"$f":"'Data Update Form'!$H$58","v":100},{"$f":"'Data Update Form'!$H$58","v":100},{"$f":"'Data Update Form'!$H$60","v":60},{"$f":"'Data Update Form'!$H$60","v":60},{"$f":"'Data Update Form'!$H$60","v":60},{"$f":"'Data Update Form'!$H$60","v":60},{"$f":"'Data Update Form'!$H$60","v":60},{"$f":"'Data Update Form'!$H$62","v":110},{"$f":"'Data Update Form'!$H$62","v":110},{"$f":"'Data Update Form'!$H$62","v":110},{"$f":"'Data Update Form'!$H$62","v":110},{"$f":"'Data Update Form'!$H$62","v":110},{"$f":"'Data Update Form'!$H$62","v":110},{"$f":"'Data Update Form'!$H$62","v":110},{"$f":"'Data Update Form'!$H$62","v":110},{"$f":"'Data Update Form'!$H$62","v":110},{"$f":"'Data Update Form'!$H$62","v":110},{"$f":"'Data Update Form'!$H$62","v":110},{"$f":"'Data Update Form'!$H$62","v":110},{"$f":"'Data Update Form'!$H$62","v":110},{"$f":"'Data Update Form'!$H$62","v":110}]
[23,"BARLEY",100,4,{"$f":"'Data Update Form'!$I$51","v":75},{"$f":"'Data Update Form'!$I$53","v":125},null,{"$f":"'Data Update Form'!$I$55","v":125},{"$f":"'Data Update Form'!$I$57","v":135},{"$f":"'Data Update Form'!$I$57","v":135},{"$f":"'Data Update Form'!$I$59","v":95},{"$f":"'Data Update Form'!$I$59","v":95},{"$f":"'Data Update Form'!$I$59","v":95},{"$f":"'Data Update Form'!$I$59","v":95},{"$f":"'Data Update Form'!$I$59","v":95},{"$f":"'Data Update Form'!$I$61","v":145},{"$f":"'Data Update Form'!$I$61","v":145},{"$f":"'Data Update Form'!$I$61","v":145},{"$f":"'Data Update Form'!$I$61","v":145},{"$f":"'Data Update Form'!$I$61","v":145},{"$f":"'Data Update Form'!$I$61","v":145},{"$f":"'Data Update Form'!$I$61","v":145},{"$f":"'Data Update Form'!$I$61","v":145},{"$f":"'Data Update Form'!$I$61","v":145},{"$f":"'Data Update Form'!$I$61","v":145},{"$f":"'Data Update Form'!$I$61","v":145},{"$f":"'Data Update Form'!$I$61","v":145},{"$f":"'Data Update Form'!$I$61","v":145},{"$f":"'Data Update Form'!$I$61","v":145},"BARLEY",100,4,{"$f":"'Data Update Form'!$I$52","v":55},{"$f":"'Data Update Form'!$I$54","v":105},null,{"$f":"'Data Update Form'!$I$56","v":105},{"$f":"'Data Update Form'!$I$58","v":115},{"$f":"'Data Update Form'!$I$58","v":115},{"$f":"'Data Update Form'!$I$60","v":75},{"$f":"'Data Update Form'!$I$60","v":75},{"$f":"'Data Update Form'!$I$60","v":75},{"$f":"'Data Update Form'!$I$60","v":75},{"$f":"'Data Update Form'!$I$60","v":75},{"$f":"'Data Update Form'!$I$62","v":125},{"$f":"'Data Update Form'!$I$62","v":125},{"$f":"'Data Update Form'!$I$62","v":125},{"$f":"'Data Update Form'!$I$62","v":125},{"$f":"'Data Update Form'!$I$62","v":125},{"$f":"'Data Update Form'!$I$62","v":125},{"$f":"'Data Update Form'!$I$62","v":125},{"$f":"'Data Update Form'!$I$62","v":125},{"$f":"'Data Update Form'!$I$62","v":125},{"$f":"'Data Update Form'!$I$62","v":125},{"$f":"'Data Update Form'!$I$62","v":125},{"$f":"'Data Update Form'!$I$62","v":125},{"$f":"'Data Update Form'!$I$62","v":125},{"$f":"'Data Update Form'!$I$62","v":125}]
[24]
[25,"OATS",0,14,{"$f":"'Data Update Form'!$C$73","v":0},{"$f":"'Data Update Form'!$C$75","v":0},null,{"$f":"'Data Update Form'!$C$77","v":0},{"$f":"'Data Update Form'!$C$79","v":20},{"$f":"'Data Update Form'!$C$79","v":20},{"$f":"'Data Update Form'!$C$81","v":0},{"$f":"'Data Update Form'!$C$81","v":0},{"$f":"'Data Update Form'!$C$81","v":0},{"$f":"'Data Update Form'!$C$81","v":0},{"$f":"'Data Update Form'!$C$81","v":0},{"$f":"'Data Update Form'!$C$83","v":40},{"$f":"'Data Update Form'!$C$83","v":40},{"$f":"'Data Update Form'!$C$83","v":40},{"$f":"'Data Update Form'!$C$83","v":40},{"$f":"'Data Update Form'!$C$83","v":40},{"$f":"'Data Update Form'!$C$83","v":40},{"$f":"'Data Update Form'!$C$83","v":40},{"$f":"'Data Update Form'!$C$83","v":40},{"$f":"'Data Update Form'!$C$83","v":40},{"$f":"'Data Update Form'!$C$83","v":40},{"$f":"'Data Update Form'!$C$83","v":40},{"$f":"'Data Update Form'!$C$83","v":40},{"$f":"'Data Update Form'!$C$83","v":40},{"$f":"'Data Update Form'!$C$83","v":40},"OATS",0,14,{"$f":"'Data Update Form'!$C$74","v":0},{"$f":"'Data Update Form'!$C$76","v":0},null,{"$f":"'Data Update Form'!$C$78","v":0},{"$f":"'Data Update Form'!$C$80","v":10},{"$f":"'Data Update Form'!$C$80","v":10},{"$f":"'Data Update Form'!$C$82","v":0},{"$f":"'Data Update Form'!$C$82","v":0},{"$f":"'Data Update Form'!$C$82","v":0},{"$f":"'Data Update Form'!$C$82","v":0},{"$f":"'Data Update Form'!$C$82","v":0},{"$f":"'Data Update Form'!$C$84","v":30},{"$f":"'Data Update Form'!$C$84","v":30},{"$f":"'Data Update Form'!$C$84","v":30},{"$f":"'Data Update Form'!$C$84","v":30},{"$f":"'Data Update Form'!$C$84","v":30},{"$f":"'Data Update Form'!$C$84","v":30},{"$f":"'Data Update Form'!$C$84","v":30},{"$f":"'Data Update Form'!$C$84","v":30},{"$f":"'Data Update Form'!$C$84","v":30},{"$f":"'Data Update Form'!$C$84","v":30},{"$f":"'Data Update Form'!$C$84","v":30},{"$f":"'Data Update Form'!$C$84","v":30},{"$f":"'Data Update Form'!$C$84","v":30},{"$f":"'Data Update Form'!$C$84","v":30}]
[26,"OATS",61,14,{"$f":"'Data Update Form'!$D$73","v":0},{"$f":"'Data Update Form'!$D$75","v":20},null,{"$f":"'Data Update Form'!$D$77","v":20},{"$f":"'Data Update Form'!$D$79","v":40},{"$f":"'Data Update Form'!$D$79","v":40},{"$f":"'Data Update Form'!$D$81","v":0},{"$f":"'Data Update Form'!$D$81","v":0},{"$f":"'Data Update Form'!$D$81","v":0},{"$f":"'Data Update Form'!$D$81","v":0},{"$f":"'Data Update Form'!$D$81","v":0},{"$f":"'Data Update Form'!$D$83","v":60},{"$f":"'Data Update Form'!$D$83","v":60},{"$f":"'Data Update Form'!$D$83","v":60},{"$f":"'Data Update Form'!$D$83","v":60},{"$f":"'Data Update Form'!$D$83","v":60},{"$f":"'Data Update Form'!$D$83","v":60},{"$f":"'Data Update Form'!$D$83","v":60},{"$f":"'Data Update Form'!$D$83","v":60},{"$f":"'Data Update Form'!$D$83","v":60},{"$f":"'Data Update Form'!$D$83","v":60},{"$f":"'Data Update Form'!$D$83","v":60},{"$f":"'Data Update Form'!$D$83","v":60},{"$f":"'Data Update Form'!$D$83","v":60},{"$f":"'Data Update Form'!$D$83","v":60},"OATS",61,14,{"$f":"'Data Update Form'!$D$74","v":0},{"$f":"'Data Update Form'!$D$76","v":0},null,{"$f":"'Data Update Form'!$D$78","v":0},{"$f":"'Data Update Form'!$D$80","v":30},{"$f":"'Data Update Form'!$D$80","v":30},{"$f":"'Data Update Form'!$D$82","v":0},{"$f":"'Data Update Form'!$D$82","v":0},{"$f":"'Data Update Form'!$D$82","v":0},{"$f":"'Data Update Form'!$D$82","v":0},{"$f":"'Data Update Form'!$D$82","v":0},{"$f":"'Data Update Form'!$D$84","v":50},{"$f":"'Data Update Form'!$D$84","v":50},{"$f":"'Data Update Form'!$D$84","v":50},{"$f":"'Data Update Form'!$D$84","v":50},{"$f":"'Data Update Form'!$D$84","v":50},{"$f":"'Data Update Form'!$D$84","v":50},{"$f":"'Data Update Form'!$D$84","v":50},{"$f":"'Data Update Form'!$D$84","v":50},{"$f":"'Data Update Form'!$D$84","v":50},{"$f":"'Data Update Form'!$D$84","v":50},{"$f":"'Data Update Form'!$D$84","v":50},{"$f":"'Data Update Form'!$D$84","v":50},{"$f":"'Data Update Form'!$D$84","v":50},{"$f":"'Data Update Form'!$D$84","v":50}]
[27,"OATS",81,14,{"$f":"'Data Update Form'!$E$73","v":0},{"$f":"'Data Update Form'!$E$75","v":40},null,{"$f":"'Data Update Form'!$E$77","v":40},{"$f":"'Data Update Form'!$E$79","v":60},{"$f":"'Data Update Form'!$E$79","v":60},{"$f":"'Data Update Form'!$E$81","v":0},{"$f":"'Data Update Form'!$E$81","v":0},{"$f":"'Data Update Form'!$E$81","v":0},{"$f":"'Data Update Form'!$E$81","v":0},{"$f":"'Data Update Form'!$E$81","v":0},{"$f":"'Data Update Form'!$E$83","v":80},{"$f":"'Data Update Form'!$E$83","v":80},{"$f":"'Data Update Form'!$E$83","v":80},{"$f":"'Data Update Form'!$E$83","v":80},{"$f":"'Data Update Form'!$E$83","v":80},{"$f":"'Data Update Form'!$E$83","v":80},{"$f":"'Data Update Form'!$E$83","v":80},{"$f":"'Data Update Form'!$E$83","v":80},{"$f":"'Data Update Form'!$E$83","v":80},{"$f":"'Data Update Form'!$E$83","v":80},{"$f":"'Data Update Form'!$E$83","v":80},{"$f":"'Data Update Form'!$E$83","v":80},{"$f":"'Data Update Form'!$E$83","v":80},{"$f":"'Data Update Form'!$E$83","v":80},"OATS",81,14,{"$f":"'Data Update Form'!$E$74","v":0},{"$f":"'Data Update Form'!$E$76","v":30},null,{"$f":"'Data Update Form'!$E$78","v":30},{"$f":"'Data Update Form'!$E$80","v":50},{"$f":"'Data Update Form'!$E$80","v":50},{"$f":"'Data Update Form'!$E$82","v":0},{"$f":"'Data Update Form'!$E$82","v":0},{"$f":"'Data Update Form'!$E$82","v":0},{"$f":"'Data Update Form'!$E$82","v":0},{"$f":"'Data Update Form'!$E$82","v":0},{"$f":"'Data Update Form'!$E$84","v":70},{"$f":"'Data Update Form'!$E$84","v":70},{"$f":"'Data Update Form'!$E$84","v":70},{"$f":"'Data Update Form'!$E$84","v":70},{"$f":"'Data Update Form'!$E$84","v":70},{"$f":"'Data Update Form'!$E$84","v":70},{"$f":"'Data Update Form'!$E$84","v":70},{"$f":"'Data Update Form'!$E$84","v":70},{"$f":"'Data Update Form'!$E$84","v":70},{"$f":"'Data Update Form'!$E$84","v":70},{"$f":"'Data Update Form'!$E$84","v":70},{"$f":"'Data Update Form'!$E$84","v":70},{"$f":"'Data Update Form'!$E$84","v":70},{"$f":"'Data Update Form'!$E$84","v":70}]
[28,"OATS",101,14,{"$f":"'Data Update Form'!$F$73","v":0},{"$f":"'Data Update Form'!$F$75","v":60},null,{"$f":"'Data Update Form'!$F$77","v":60},{"$f":"'Data Update Form'!$F$79","v":80},{"$f":"'Data Update Form'!$F$79","v":80},{"$f":"'Data Update Form'!$F$81","v":25},{"$f":"'Data Update Form'!$F$81","v":25},{"$f":"'Data Update Form'!$F$81","v":25},{"$f":"'Data Update Form'!$F$81","v":25},{"$f":"'Data Update Form'!$F$81","v":25},{"$f":"'Data Update Form'!$F$83","v":100},{"$f":"'Data Update Form'!$F$83","v":100},{"$f":"'Data Update Form'!$F$83","v":100},{"$f":"'Data Update Form'!$F$83","v":100},{"$f":"'Data Update Form'!$F$83","v":100},{"$f":"'Data Update Form'!$F$83","v":100},{"$f":"'Data Update Form'!$F$83","v":100},{"$f":"'Data Update Form'!$F$83","v":100},{"$f":"'Data Update Form'!$F$83","v":100},{"$f":"'Data Update Form'!$F$83","v":100},{"$f":"'Data Update Form'!$F$83","v":100},{"$f":"'Data Update Form'!$F$83","v":100},{"$f":"'Data Update Form'!$F$83","v":100},{"$f":"'Data Update Form'!$F$83","v":100},"OATS",101,14,{"$f":"'Data Update Form'!$F$74","v":0},{"$f":"'Data Update Form'!$F$76","v":50},null,{"$f":"'Data Update Form'!$F$78","v":50},{"$f":"'Data Update Form'!$F$80","v":70},{"$f":"'Data Update Form'!$F$80","v":70},{"$f":"'Data Update Form'!$F$82","v":15},{"$f":"'Data Update Form'!$F$82","v":15},{"$f":"'Data Update Form'!$F$82","v":15},{"$f":"'Data Update Form'!$F$82","v":15},{"$f":"'Data Update Form'!$F$82","v":15},{"$f":"'Data Update Form'!$F$84","v":90},{"$f":"'Data Update Form'!$F$84","v":90},{"$f":"'Data Update Form'!$F$84","v":90},{"$f":"'Data Update Form'!$F$84","v":90},{"$f":"'Data Update Form'!$F$84","v":90},{"$f":"'Data Update Form'!$F$84","v":90},{"$f":"'Data Update Form'!$F$84","v":90},{"$f":"'Data Update Form'!$F$84","v":90},{"$f":"'Data Update Form'!$F$84","v":90},{"$f":"'Data Update Form'!$F$84","v":90},{"$f":"'Data Update Form'!$F$84","v":90},{"$f":"'Data Update Form'!$F$84","v":90},{"$f":"'Data Update Form'!$F$84","v":90},{"$f":"'Data Update Form'!$F$84","v":90}]
[29,"OATS",121,14,{"$f":"'Data Update Form'!$G$73","v":0},{"$f":"'Data Update Form'!$G$75","v":80},null,{"$f":"'Data Update Form'!$G$77","v":80},{"$f":"'Data Update Form'!$G$79","v":100},{"$f":"'Data Update Form'!$G$79","v":100},{"$f":"'Data Update Form'!$G$81","v":45},{"$f":"'Data Update Form'!$G$81","v":45},{"$f":"'Data Update Form'!$G$81","v":45},{"$f":"'Data Update Form'!$G$81","v":45},{"$f":"'Data Update Form'!$G$81","v":45},{"$f":"'Data Update Form'!$G$83","v":120},{"$f":"'Data Update Form'!$G$83","v":120},{"$f":"'Data Update Form'!$G$83","v":120},{"$f":"'Data Update Form'!$G$83","v":120},{"$f":"'Data Update Form'!$G$83","v":120},{"$f":"'Data Update Form'!$G$83","v":120},{"$f":"'Data Update Form'!$G$83","v":120},{"$f":"'Data Update Form'!$G$83","v":120},{"$f":"'Data Update Form'!$G$83","v":120},{"$f":"'Data Update Form'!$G$83","v":120},{"$f":"'Data Update Form'!$G$83","v":120},{"$f":"'Data Update Form'!$G$83","v":120},{"$f":"'Data Update Form'!$G$83","v":120},{"$f":"'Data Update Form'!$G$83","v":120},"OATS",121,14,{"$f":"'Data Update Form'!$G$74","v":0},{"$f":"'Data Update Form'!$G$76","v":70},null,{"$f":"'Data Update Form'!$G$78","v":70},{"$f":"'Data Update Form'!$G$80","v":90},{"$f":"'Data Update Form'!$G$80","v":90},{"$f":"'Data Update Form'!$G$82","v":35},{"$f":"'Data Update Form'!$G$82","v":35},{"$f":"'Data Update Form'!$G$82","v":35},{"$f":"'Data Update Form'!$G$82","v":35},{"$f":"'Data Update Form'!$G$82","v":35},{"$f":"'Data Update Form'!$G$84","v":110},{"$f":"'Data Update Form'!$G$84","v":110},{"$f":"'Data Update Form'!$G$84","v":110},{"$f":"'Data Update Form'!$G$84","v":110},{"$f":"'Data Update Form'!$G$84","v":110},{"$f":"'Data Update Form'!$G$84","v":110},{"$f":"'Data Update Form'!$G$84","v":110},{"$f":"'Data Update Form'!$G$84","v":110},{"$f":"'Data Update Form'!$G$84","v":110},{"$f":"'Data Update Form'!$G$84","v":110},{"$f":"'Data Update Form'!$G$84","v":110},{"$f":"'Data Update Form'!$G$84","v":110},{"$f":"'Data Update Form'!$G$84","v":110},{"$f":"'Data Update Form'!$G$84","v":110}]
[30]
[31,"ALFALFA",0,1,null,null,null,null,null,null,null,null,null,null,null,null,null,null,null,null,null,null,null,null,null,null,null,null,null,"ALFALFA",0,1]
[32]
[33,"GRASS/HAY",0,11,null,null,null,null,null,null,null,null,null,null,null,null,null,null,null,null,null,null,null,null,null,null,null,null,null,"GRASS/HAY",0,11]
[34]
[35,"SOYBEANS",0,20,null,null,null,null,null,null,null,null,null,null,null,null,null,null,null,null,null,null,null,null,null,null,null,null,null,"SOYBEANS",0,20]
[36]
[37,"SILAGE",0,19,null,null,null,null,null,null,null,null,null,null,null,null,null,null,null,null,null,null,null,null,null,null,null,null,null,"SILAGE",0,19]
[38]
[39,"Buckwheat",0,5,{"$f":"'Data Update Form'!$C$93","v":0},{"$f":"'Data Update Form'!$C$95","v":0},null,{"$f":"'Data Update Form'!$C$97","v":0},{"$f":"'Data Update Form'!$C$99","v":20},{"$f":"'Data Update Form'!$C$99","v":20},{"$f":"'Data Update Form'!$C$101","v":0},{"$f":"'Data Update Form'!$C$101","v":0},{"$f":"'Data Update Form'!$C$101","v":0},{"$f":"'Data Update Form'!$C$101","v":0},{"$f":"'Data Update Form'!$C$101","v":0},{"$f":"'Data Update Form'!$C$103","v":40},{"$f":"'Data Update Form'!$C$103","v":40},{"$f":"'Data Update Form'!$C$103","v":40},{"$f":"'Data Update Form'!$C$103","v":40},{"$f":"'Data Update Form'!$C$103","v":40},{"$f":"'Data Update Form'!$C$103","v":40},{"$f":"'Data Update Form'!$C$103","v":40},{"$f":"'Data Update Form'!$C$103","v":40},{"$f":"'Data Update Form'!$C$103","v":40},{"$f":"'Data Update Form'!$C$103","v":40},{"$f":"'Data Update Form'!$C$103","v":40},{"$f":"'Data Update Form'!$C$103","v":40},{"$f":"'Data Update Form'!$C$103","v":40},{"$f":"'Data Update Form'!$C$103","v":40},"Buckwheat",0,5,{"$f":"'Data Update Form'!$C$94","v":0},{"$f":"'Data Update Form'!$C$96","v":0},null,{"$f":"'Data Update Form'!$C$98","v":0},{"$f":"'Data Update Form'!$C$100","v":0},{"$f":"'Data Update Form'!$C$100","v":0},{"$f":"'Data Update Form'!$C$102","v":0},{"$f":"'Data Update Form'!$C$102","v":0},{"$f":"'Data Update Form'!$C$102","v":0},{"$f":"'Data Update Form'!$C$102","v":0},{"$f":"'Data Update Form'!$C$102","v":0},{"$f":"'Data Update Form'!$C$104","v":20},{"$f":"'Data Update Form'!$C$104","v":20},{"$f":"'Data Update Form'!$C$104","v":20},{"$f":"'Data Update Form'!$C$104","v":20},{"$f":"'Data Update Form'!$C$104","v":20},{"$f":"'Data Update Form'!$C$104","v":20},{"$f":"'Data Update Form'!$C$104","v":20},{"$f":"'Data Update Form'!$C$104","v":20},{"$f":"'Data Update Form'!$C$104","v":20},{"$f":"'Data Update Form'!$C$104","v":20},{"$f":"'Data Update Form'!$C$104","v":20},{"$f":"'Data Update Form'!$C$104","v":20},{"$f":"'Data Update Form'!$C$104","v":20},{"$f":"'Data Update Form'!$C$104","v":20}]
[40,"Buckwheat",1451,5,{"$f":"'Data Update Form'!$D$93","v":0},{"$f":"'Data Update Form'!$D$95","v":10},null,{"$f":"'Data Update Form'!$D$97","v":10},{"$f":"'Data Update Form'!$D$99","v":30},{"$f":"'Data Update Form'!$D$99","v":30},{"$f":"'Data Update Form'!$D$101","v":0},{"$f":"'Data Update Form'!$D$101","v":0},{"$f":"'Data Update Form'!$D$101","v":0},{"$f":"'Data Update Form'!$D$101","v":0},{"$f":"'Data Update Form'!$D$101","v":0},{"$f":"'Data Update Form'!$D$103","v":50},{"$f":"'Data Update Form'!$D$103","v":50},{"$f":"'Data Update Form'!$D$103","v":50},{"$f":"'Data Update Form'!$D$103","v":50},{"$f":"'Data Update Form'!$D$103","v":50},{"$f":"'Data Update Form'!$D$103","v":50},{"$f":"'Data Update Form'!$D$103","v":50},{"$f":"'Data Update Form'!$D$103","v":50},{"$f":"'Data Update Form'!$D$103","v":50},{"$f":"'Data Update Form'!$D$103","v":50},{"$f":"'Data Update Form'!$D$103","v":50},{"$f":"'Data Update Form'!$D$103","v":50},{"$f":"'Data Update Form'!$D$103","v":50},{"$f":"'Data Update Form'!$D$103","v":50},"Buckwheat",1451,5,{"$f":"'Data Update Form'!$D$94","v":0},{"$f":"'Data Update Form'!$D$96","v":0},null,{"$f":"'Data Update Form'!$D$98","v":0},{"$f":"'Data Update Form'!$D$100","v":10},{"$f":"'Data Update Form'!$D$100","v":10},{"$f":"'Data Update Form'!$D$102","v":0},{"$f":"'Data Update Form'!$D$102","v":0},{"$f":"'Data Update Form'!$D$102","v":0},{"$f":"'Data Update Form'!$D$102","v":0},{"$f":"'Data Update Form'!$D$102","v":0},{"$f":"'Data Update Form'!$D$104","v":30},{"$f":"'Data Update Form'!$D$104","v":30},{"$f":"'Data Update Form'!$D$104","v":30},{"$f":"'Data Update Form'!$D$104","v":30},{"$f":"'Data Update Form'!$D$104","v":30},{"$f":"'Data Update Form'!$D$104","v":30},{"$f":"'Data Update Form'!$D$104","v":30},{"$f":"'Data Update Form'!$D$104","v":30},{"$f":"'Data Update Form'!$D$104","v":30},{"$f":"'Data Update Form'!$D$104","v":30},{"$f":"'Data Update Form'!$D$104","v":30},{"$f":"'Data Update Form'!$D$104","v":30},{"$f":"'Data Update Form'!$D$104","v":30},{"$f":"'Data Update Form'!$D$104","v":30}]
[41,"Buckwheat",1701,5,{"$f":"'Data Update Form'!$E$93","v":0},{"$f":"'Data Update Form'!$E$95","v":20},null,{"$f":"'Data Update Form'!$E$97","v":20},{"$f":"'Data Update Form'!$E$99","v":40},{"$f":"'Data Update Form'!$E$99","v":40},{"$f":"'Data Update Form'!$E$101","v":0},{"$f":"'Data Update Form'!$E$101","v":0},{"$f":"'Data Update Form'!$E$101","v":0},{"$f":"'Data Update Form'!$E$101","v":0},{"$f":"'Data Update Form'!$E$101","v":0},{"$f":"'Data Update Form'!$E$103","v":60},{"$f":"'Data Update Form'!$E$103","v":60},{"$f":"'Data Update Form'!$E$103","v":60},{"$f":"'Data Update Form'!$E$103","v":60},{"$f":"'Data Update Form'!$E$103","v":60},{"$f":"'Data Update Form'!$E$103","v":60},{"$f":"'Data Update Form'!$E$103","v":60},{"$f":"'Data Update Form'!$E$103","v":60},{"$f":"'Data Update Form'!$E$103","v":60},{"$f":"'Data Update Form'!$E$103","v":60},{"$f":"'Data Update Form'!$E$103","v":60},{"$f":"'Data Update Form'!$E$103","v":60},{"$f":"'Data Update Form'!$E$103","v":60},{"$f":"'Data Update Form'!$E$103","v":60},"Buckwheat",1701,5,{"$f":"'Data Update Form'!$E$94","v":0},{"$f":"'Data Update Form'!$E$96","v":0},null,{"$f":"'Data Update Form'!$E$98","v":0},{"$f":"'Data Update Form'!$E$100","v":20},{"$f":"'Data Update Form'!$E$100","v":20},{"$f":"'Data Update Form'!$E$102","v":0},{"$f":"'Data Update Form'!$E$102","v":0},{"$f":"'Data Update Form'!$E$102","v":0},{"$f":"'Data Update Form'!$E$102","v":0},{"$f":"'Data Update Form'!$E$102","v":0},{"$f":"'Data Update Form'!$E$104","v":40},{"$f":"'Data Update Form'!$E$104","v":40},{"$f":"'Data Update Form'!$E$104","v":40},{"$f":"'Data Update Form'!$E$104","v":40},{"$f":"'Data Update Form'!$E$104","v":40},{"$f":"'Data Update Form'!$E$104","v":40},{"$f":"'Data Update Form'!$E$104","v":40},{"$f":"'Data Update Form'!$E$104","v":40},{"$f":"'Data Update Form'!$E$104","v":40},{"$f":"'Data Update Form'!$E$104","v":40},{"$f":"'Data Update Form'!$E$104","v":40},{"$f":"'Data Update Form'!$E$104","v":40},{"$f":"'Data Update Form'!$E$104","v":40},{"$f":"'Data Update Form'!$E$104","v":40}]
[42,"Buckwheat",1951,5,{"$f":"'Data Update Form'!$F$93","v":0},{"$f":"'Data Update Form'!$F$95","v":30},null,{"$f":"'Data Update Form'!$F$97","v":30},{"$f":"'Data Update Form'!$F$99","v":50},{"$f":"'Data Update Form'!$F$99","v":50},{"$f":"'Data Update Form'!$F$101","v":0},{"$f":"'Data Update Form'!$F$101","v":0},{"$f":"'Data Update Form'!$F$101","v":0},{"$f":"'Data Update Form'!$F$101","v":0},{"$f":"'Data Update Form'!$F$101","v":0},{"$f":"'Data Update Form'!$F$103","v":70},{"$f":"'Data Update Form'!$F$103","v":70},{"$f":"'Data Update Form'!$F$103","v":70},{"$f":"'Data Update Form'!$F$103","v":70},{"$f":"'Data Update Form'!$F$103","v":70},{"$f":"'Data Update Form'!$F$103","v":70},{"$f":"'Data Update Form'!$F$103","v":70},{"$f":"'Data Update Form'!$F$103","v":70},{"$f":"'Data Update Form'!$F$103","v":70},{"$f":"'Data Update Form'!$F$103","v":70},{"$f":"'Data Update Form'!$F$103","v":70},{"$f":"'Data Update Form'!$F$103","v":70},{"$f":"'Data Update Form'!$F$103","v":70},{"$f":"'Data Update Form'!$F$103","v":70},"Buckwheat",1951,5,{"$f":"'Data Update Form'!$F$94","v":0},{"$f":"'Data Update Form'!$F$96","v":0},null,{"$f":"'Data Update Form'!$F$98","v":0},{"$f":"'Data Update Form'!$F$100","v":30},{"$f":"'Data Update Form'!$F$100","v":30},{"$f":"'Data Update Form'!$F$102","v":0},{"$f":"'Data Update Form'!$F$102","v":0},{"$f":"'Data Update Form'!$F$102","v":0},{"$f":"'Data Update Form'!$F$102","v":0},{"$f":"'Data Update Form'!$F$102","v":0},{"$f":"'Data Update Form'!$F$104","v":50},{"$f":"'Data Update Form'!$F$104","v":50},{"$f":"'Data Update Form'!$F$104","v":50},{"$f":"'Data Update Form'!$F$104","v":50},{"$f":"'Data Update Form'!$F$104","v":50},{"$f":"'Data Update Form'!$F$104","v":50},{"$f":"'Data Update Form'!$F$104","v":50},{"$f":"'Data Update Form'!$F$104","v":50},{"$f":"'Data Update Form'!$F$104","v":50},{"$f":"'Data Update Form'!$F$104","v":50},{"$f":"'Data Update Form'!$F$104","v":50},{"$f":"'Data Update Form'!$F$104","v":50},{"$f":"'Data Update Form'!$F$104","v":50},{"$f":"'Data Update Form'!$F$104","v":50}]
[43]
[44,"Canola",0,6,{"$f":"'Data Update Form'!$C$113","v":0},{"$f":"'Data Update Form'!$C$115","v":0},null,{"$f":"'Data Update Form'!$C$117","v":0},{"$f":"'Data Update Form'!$C$119","v":20},{"$f":"'Data Update Form'!$C$119","v":20},{"$f":"'Data Update Form'!$C$121","v":0},{"$f":"'Data Update Form'!$C$121","v":0},{"$f":"'Data Update Form'!$C$121","v":0},{"$f":"'Data Update Form'!$C$121","v":0},{"$f":"'Data Update Form'!$C$121","v":0},{"$f":"'Data Update Form'!$C$123","v":40},{"$f":"'Data Update Form'!$C$123","v":40},{"$f":"'Data Update Form'!$C$123","v":40},{"$f":"'Data Update Form'!$C$123","v":40},{"$f":"'Data Update Form'!$C$123","v":40},{"$f":"'Data Update Form'!$C$123","v":40},{"$f":"'Data Update Form'!$C$123","v":40},{"$f":"'Data Update Form'!$C$123","v":40},{"$f":"'Data Update Form'!$C$123","v":40},{"$f":"'Data Update Form'!$C$123","v":40},{"$f":"'Data Update Form'!$C$123","v":40},{"$f":"'Data Update Form'!$C$123","v":40},{"$f":"'Data Update Form'!$C$123","v":40},{"$f":"'Data Update Form'!$C$123","v":40},"Canola",0,6,{"$f":"'Data Update Form'!$C$114","v":0},{"$f":"'Data Update Form'!$C$116","v":0},null,{"$f":"'Data Update Form'!$C$118","v":0},{"$f":"'Data Update Form'!$C$120","v":0},{"$f":"'Data Update Form'!$C$120","v":0},{"$f":"'Data Update Form'!$C$122","v":0},{"$f":"'Data Update Form'!$C$122","v":0},{"$f":"'Data Update Form'!$C$122","v":0},{"$f":"'Data Update Form'!$C$122","v":0},{"$f":"'Data Update Form'!$C$122","v":0},{"$f":"'Data Update Form'!$C$124","v":20},{"$f":"'Data Update Form'!$C$124","v":20},{"$f":"'Data Update Form'!$C$124","v":20},{"$f":"'Data Update Form'!$C$124","v":20},{"$f":"'Data Update Form'!$C$124","v":20},{"$f":"'Data Update Form'!$C$124","v":20},{"$f":"'Data Update Form'!$C$124","v":20},{"$f":"'Data Update Form'!$C$124","v":20},{"$f":"'Data Update Form'!$C$124","v":20},{"$f":"'Data Update Form'!$C$124","v":20},{"$f":"'Data Update Form'!$C$124","v":20},{"$f":"'Data Update Form'!$C$124","v":20},{"$f":"'Data Update Form'!$C$124","v":20},{"$f":"'Data Update Form'!$C$124","v":20}]
[45,"Canola",16,6,{"$f":"'Data Update Form'!$D$113","v":0},{"$f":"'Data Update Form'!$D$115","v":10},null,{"$f":"'Data Update Form'!$D$117","v":10},{"$f":"'Data Update Form'!$D$119","v":30},{"$f":"'Data Update Form'!$D$119","v":30},{"$f":"'Data Update Form'!$D$121","v":0},{"$f":"'Data Update Form'!$D$121","v":0},{"$f":"'Data Update Form'!$D$121","v":0},{"$f":"'Data Update Form'!$D$121","v":0},{"$f":"'Data Update Form'!$D$121","v":0},{"$f":"'Data Update Form'!$D$123","v":50},{"$f":"'Data Update Form'!$D$123","v":50},{"$f":"'Data Update Form'!$D$123","v":50},{"$f":"'Data Update Form'!$D$123","v":50},{"$f":"'Data Update Form'!$D$123","v":50},{"$f":"'Data Update Form'!$D$123","v":50},{"$f":"'Data Update Form'!$D$123","v":50},{"$f":"'Data Update Form'!$D$123","v":50},{"$f":"'Data Update Form'!$D$123","v":50},{"$f":"'Data Update Form'!$D$123","v":50},{"$f":"'Data Update Form'!$D$123","v":50},{"$f":"'Data Update Form'!$D$123","v":50},{"$f":"'Data Update Form'!$D$123","v":50},{"$f":"'Data Update Form'!$D$123","v":50},"Canola",16,6,{"$f":"'Data Update Form'!$D$114","v":0},{"$f":"'Data Update Form'!$D$116","v":0},null,{"$f":"'Data Update Form'!$D$118","v":0},{"$f":"'Data Update Form'!$D$120","v":10},{"$f":"'Data Update Form'!$D$120","v":10},{"$f":"'Data Update Form'!$D$122","v":0},{"$f":"'Data Update Form'!$D$122","v":0},{"$f":"'Data Update Form'!$D$122","v":0},{"$f":"'Data Update Form'!$D$122","v":0},{"$f":"'Data Update Form'!$D$122","v":0},{"$f":"'Data Update Form'!$D$124","v":30},{"$f":"'Data Update Form'!$D$124","v":30},{"$f":"'Data Update Form'!$D$124","v":30},{"$f":"'Data Update Form'!$D$124","v":30},{"$f":"'Data Update Form'!$D$124","v":30},{"$f":"'Data Update Form'!$D$124","v":30},{"$f":"'Data Update Form'!$D$124","v":30},{"$f":"'Data Update Form'!$D$124","v":30},{"$f":"'Data Update Form'!$D$124","v":30},{"$f":"'Data Update Form'!$D$124","v":30},{"$f":"'Data Update Form'!$D$124","v":30},{"$f":"'Data Update Form'!$D$124","v":30},{"$f":"'Data Update Form'!$D$124","v":30},{"$f":"'Data Update Form'!$D$124","v":30}]
[46,"Canola",21,6,{"$f":"'Data Update Form'!$E$113","v":0},{"$f":"'Data Update Form'!$E$115","v":20},null,{"$f":"'Data Update Form'!$E$117","v":20},{"$f":"'Data Update Form'!$E$119","v":40},{"$f":"'Data Update Form'!$E$119","v":40},{"$f":"'Data Update Form'!$E$121","v":0},{"$f":"'Data Update Form'!$E$121","v":0},{"$f":"'Data Update Form'!$E$121","v":0},{"$f":"'Data Update Form'!$E$121","v":0},{"$f":"'Data Update Form'!$E$121","v":0},{"$f":"'Data Update Form'!$E$123","v":60},{"$f":"'Data Update Form'!$E$123","v":60},{"$f":"'Data Update Form'!$E$123","v":60},{"$f":"'Data Update Form'!$E$123","v":60},{"$f":"'Data Update Form'!$E$123","v":60},{"$f":"'Data Update Form'!$E$123","v":60},{"$f":"'Data Update Form'!$E$123","v":60},{"$f":"'Data Update Form'!$E$123","v":60},{"$f":"'Data Update Form'!$E$123","v":60},{"$f":"'Data Update Form'!$E$123","v":60},{"$f":"'Data Update Form'!$E$123","v":60},{"$f":"'Data Update Form'!$E$123","v":60},{"$f":"'Data Update Form'!$E$123","v":60},{"$f":"'Data Update Form'!$E$123","v":60},"Canola",21,6,{"$f":"'Data Update Form'!$E$114","v":0},{"$f":"'Data Update Form'!$E$116","v":0},null,{"$f":"'Data Update Form'!$E$118","v":0},{"$f":"'Data Update Form'!$E$120","v":20},{"$f":"'Data Update Form'!$E$120","v":20},{"$f":"'Data Update Form'!$E$122","v":0},{"$f":"'Data Update Form'!$E$122","v":0},{"$f":"'Data Update Form'!$E$122","v":0},{"$f":"'Data Update Form'!$E$122","v":0},{"$f":"'Data Update Form'!$E$122","v":0},{"$f":"'Data Update Form'!$E$124","v":40},{"$f":"'Data Update Form'!$E$124","v":40},{"$f":"'Data Update Form'!$E$124","v":40},{"$f":"'Data Update Form'!$E$124","v":40},{"$f":"'Data Update Form'!$E$124","v":40},{"$f":"'Data Update Form'!$E$124","v":40},{"$f":"'Data Update Form'!$E$124","v":40},{"$f":"'Data Update Form'!$E$124","v":40},{"$f":"'Data Update Form'!$E$124","v":40},{"$f":"'Data Update Form'!$E$124","v":40},{"$f":"'Data Update Form'!$E$124","v":40},{"$f":"'Data Update Form'!$E$124","v":40},{"$f":"'Data Update Form'!$E$124","v":40},{"$f":"'Data Update Form'!$E$124","v":40}]
[47,"Canola",25,6,{"$f":"'Data Update Form'!$F$113","v":0},{"$f":"'Data Update Form'!$F$115","v":30},null,{"$f":"'Data Update Form'!$F$117","v":30},{"$f":"'Data Update Form'!$F$119","v":50},{"$f":"'Data Update Form'!$F$119","v":50},{"$f":"'Data Update Form'!$F$121","v":0},{"$f":"'Data Update Form'!$F$121","v":0},{"$f":"'Data Update Form'!$F$121","v":0},{"$f":"'Data Update Form'!$F$121","v":0},{"$f":"'Data Update Form'!$F$121","v":0},{"$f":"'Data Update Form'!$F$123","v":70},{"$f":"'Data Update Form'!$F$123","v":70},{"$f":"'Data Update Form'!$F$123","v":70},{"$f":"'Data Update Form'!$F$123","v":70},{"$f":"'Data Update Form'!$F$123","v":70},{"$f":"'Data Update Form'!$F$123","v":70},{"$f":"'Data Update Form'!$F$123","v":70},{"$f":"'Data Update Form'!$F$123","v":70},{"$f":"'Data Update Form'!$F$123","v":70},{"$f":"'Data Update Form'!$F$123","v":70},{"$f":"'Data Update Form'!$F$123","v":70},{"$f":"'Data Update Form'!$F$123","v":70},{"$f":"'Data Update Form'!$F$123","v":70},{"$f":"'Data Update Form'!$F$123","v":70},"Canola",25,6,{"$f":"'Data Update Form'!$F$114","v":0},{"$f":"'Data Update Form'!$F$116","v":0},null,{"$f":"'Data Update Form'!$F$118","v":0},{"$f":"'Data Update Form'!$F$120","v":30},{"$f":"'Data Update Form'!$F$120","v":30},{"$f":"'Data Update Form'!$F$122","v":0},{"$f":"'Data Update Form'!$F$122","v":0},{"$f":"'Data Update Form'!$F$122","v":0},{"$f":"'Data Update Form'!$F$122","v":0},{"$f":"'Data Update Form'!$F$122","v":0},{"$f":"'Data Update Form'!$F$124","v":50},{"$f":"'Data Update Form'!$F$124","v":50},{"$f":"'Data Update Form'!$F$124","v":50},{"$f":"'Data Update Form'!$F$124","v":50},{"$f":"'Data Update Form'!$F$124","v":50},{"$f":"'Data Update Form'!$F$124","v":50},{"$f":"'Data Update Form'!$F$124","v":50},{"$f":"'Data Update Form'!$F$124","v":50},{"$f":"'Data Update Form'!$F$124","v":50},{"$f":"'Data Update Form'!$F$124","v":50},{"$f":"'Data Update Form'!$F$124","v":50},{"$f":"'Data Update Form'!$F$124","v":50},{"$f":"'Data Update Form'!$F$124","v":50},{"$f":"'Data Update Form'!$F$124","v":50}]
[48]
[49,"Edible Beans",0,9,{"$f":"'Data Update Form'!$C$133","v":0},{"$f":"'Data Update Form'!$C$135","v":0},null,{"$f":"'Data Update Form'!$C$137","v":60},{"$f":"'Data Update Form'!$C$139","v":60},{"$f":"'Data Update Form'!$C$139","v":60},{"$f":"'Data Update Form'!$C$141","v":0},{"$f":"'Data Update Form'!$C$141","v":0},{"$f":"'Data Update Form'!$C$141","v":0},{"$f":"'Data Update Form'!$C$141","v":0},{"$f":"'Data Update Form'!$C$141","v":0},{"$f":"'Data Update Form'!$C$143","v":60},{"$f":"'Data Update Form'!$C$143","v":60},{"$f":"'Data Update Form'!$C$143","v":60},{"$f":"'Data Update Form'!$C$143","v":60},{"$f":"'Data Update Form'!$C$143","v":60},{"$f":"'Data Update Form'!$C$143","v":60},{"$f":"'Data Update Form'!$C$143","v":60},{"$f":"'Data Update Form'!$C$143","v":60},{"$f":"'Data Update Form'!$C$143","v":60},{"$f":"'Data Update Form'!$C$143","v":60},{"$f":"'Data Update Form'!$C$143","v":60},{"$f":"'Data Update Form'!$C$143","v":60},{"$f":"'Data Update Form'!$C$143","v":60},{"$f":"'Data Update Form'!$C$143","v":60},"Edible Beans",0,9,{"$f":"'Data Update Form'!$C$134","v":0},{"$f":"'Data Update Form'!$C$136","v":0},null,{"$f":"'Data Update Form'!$C$138","v":30},{"$f":"'Data Update Form'!$C$140","v":30},{"$f":"'Data Update Form'!$C$140","v":30},{"$f":"'Data Update Form'!$C$142","v":0},{"$f":"'Data Update Form'!$C$142","v":0},{"$f":"'Data Update Form'!$C$142","v":0},{"$f":"'Data Update Form'!$C$142","v":0},{"$f":"'Data Update Form'!$C$142","v":0},{"$f":"'Data Update Form'!$C$144","v":30},{"$f":"'Data Update Form'!$C$144","v":30},{"$f":"'Data Update Form'!$C$144","v":30},{"$f":"'Data Update Form'!$C$144","v":30},{"$f":"'Data Update Form'!$C$144","v":30},{"$f":"'Data Update Form'!$C$144","v":30},{"$f":"'Data Update Form'!$C$144","v":30},{"$f":"'Data Update Form'!$C$144","v":30},{"$f":"'Data Update Form'!$C$144","v":30},{"$f":"'Data Update Form'!$C$144","v":30},{"$f":"'Data Update Form'!$C$144","v":30},{"$f":"'Data Update Form'!$C$144","v":30},{"$f":"'Data Update Form'!$C$144","v":30},{"$f":"'Data Update Form'!$C$144","v":30}]
[50,"Edible Beans",1901,9,{"$f":"'Data Update Form'!$D$133","v":0},{"$f":"'Data Update Form'!$D$135","v":20},null,{"$f":"'Data Update Form'!$D$137","v":80},{"$f":"'Data Update Form'!$D$139","v":80},{"$f":"'Data Update Form'!$D$139","v":80},{"$f":"'Data Update Form'!$D$141","v":0},{"$f":"'Data Update Form'!$D$141","v":0},{"$f":"'Data Update Form'!$D$141","v":0},{"$f":"'Data Update Form'!$D$141","v":0},{"$f":"'Data Update Form'!$D$141","v":0},{"$f":"'Data Update Form'!$D$143","v":80},{"$f":"'Data Update Form'!$D$143","v":80},{"$f":"'Data Update Form'!$D$143","v":80},{"$f":"'Data Update Form'!$D$143","v":80},{"$f":"'Data Update Form'!$D$143","v":80},{"$f":"'Data Update Form'!$D$143","v":80},{"$f":"'Data Update Form'!$D$143","v":80},{"$f":"'Data Update Form'!$D$143","v":80},{"$f":"'Data Update Form'!$D$143","v":80},{"$f":"'Data Update Form'!$D$143","v":80},{"$f":"'Data Update Form'!$D$143","v":80},{"$f":"'Data Update Form'!$D$143","v":80},{"$f":"'Data Update Form'!$D$143","v":80},{"$f":"'Data Update Form'!$D$143","v":80},"Edible Beans",1901,9,{"$f":"'Data Update Form'!$D$134","v":0},{"$f":"'Data Update Form'!$D$136","v":0},null,{"$f":"'Data Update Form'!$D$138","v":50},{"$f":"'Data Update Form'!$D$140","v":50},{"$f":"'Data Update Form'!$D$140","v":50},{"$f":"'Data Update Form'!$D$142","v":0},{"$f":"'Data Update Form'!$D$142","v":0},{"$f":"'Data Update Form'!$D$142","v":0},{"$f":"'Data Update Form'!$D$142","v":0},{"$f":"'Data Update Form'!$D$142","v":0},{"$f":"'Data Update Form'!$D$144","v":50},{"$f":"'Data Update Form'!$D$144","v":50},{"$f":"'Data Update Form'!$D$144","v":50},{"$f":"'Data Update Form'!$D$144","v":50},{"$f":"'Data Update Form'!$D$144","v":50},{"$f":"'Data Update Form'!$D$144","v":50},{"$f":"'Data Update Form'!$D$144","v":50},{"$f":"'Data Update Form'!$D$144","v":50},{"$f":"'Data Update Form'!$D$144","v":50},{"$f":"'Data Update Form'!$D$144","v":50},{"$f":"'Data Update Form'!$D$144","v":50},{"$f":"'Data Update Form'!$D$144","v":50},{"$f":"'Data Update Form'!$D$144","v":50},{"$f":"'Data Update Form'!$D$144","v":50}]
[51,"Edible Beans",2401,9,{"$f":"'Data Update Form'!$E$133","v":0},{"$f":"'Data Update Form'!$E$135","v":40},null,{"$f":"'Data Update Form'!$E$137","v":100},{"$f":"'Data Update Form'!$E$139","v":100},{"$f":"'Data Update Form'!$E$139","v":100},{"$f":"'Data Update Form'!$E$141","v":25},{"$f":"'Data Update Form'!$E$141","v":25},{"$f":"'Data Update Form'!$E$141","v":25},{"$f":"'Data Update Form'!$E$141","v":25},{"$f":"'Data Update Form'!$E$141","v":25},{"$f":"'Data Update Form'!$E$143","v":100},{"$f":"'Data Update Form'!$E$143","v":100},{"$f":"'Data Update Form'!$E$143","v":100},{"$f":"'Data Update Form'!$E$143","v":100},{"$f":"'Data Update Form'!$E$143","v":100},{"$f":"'Data Update Form'!$E$143","v":100},{"$f":"'Data Update Form'!$E$143","v":100},{"$f":"'Data Update Form'!$E$143","v":100},{"$f":"'Data Update Form'!$E$143","v":100},{"$f":"'Data Update Form'!$E$143","v":100},{"$f":"'Data Update Form'!$E$143","v":100},{"$f":"'Data Update Form'!$E$143","v":100},{"$f":"'Data Update Form'!$E$143","v":100},{"$f":"'Data Update Form'!$E$143","v":100},"Edible Beans",2401,9,{"$f":"'Data Update Form'!$E$134","v":0},{"$f":"'Data Update Form'!$E$136","v":10},null,{"$f":"'Data Update Form'!$E$138","v":70},{"$f":"'Data Update Form'!$E$140","v":70},{"$f":"'Data Update Form'!$E$140","v":70},{"$f":"'Data Update Form'!$E$142","v":0},{"$f":"'Data Update Form'!$E$142","v":0},{"$f":"'Data Update Form'!$E$142","v":0},{"$f":"'Data Update Form'!$E$142","v":0},{"$f":"'Data Update Form'!$E$142","v":0},{"$f":"'Data Update Form'!$E$144","v":70},{"$f":"'Data Update Form'!$E$144","v":70},{"$f":"'Data Update Form'!$E$144","v":70},{"$f":"'Data Update Form'!$E$144","v":70},{"$f":"'Data Update Form'!$E$144","v":70},{"$f":"'Data Update Form'!$E$144","v":70},{"$f":"'Data Update Form'!$E$144","v":70},{"$f":"'Data Update Form'!$E$144","v":70},{"$f":"'Data Update Form'!$E$144","v":70},{"$f":"'Data Update Form'!$E$144","v":70},{"$f":"'Data Update Form'!$E$144","v":70},{"$f":"'Data Update Form'!$E$144","v":70},{"$f":"'Data Update Form'!$E$144","v":70},{"$f":"'Data Update Form'!$E$144","v":70}]
[52,"Edible Beans",2901,9,{"$f":"'Data Update Form'!$F$133","v":0},{"$f":"'Data Update Form'!$F$135","v":60},null,{"$f":"'Data Update Form'!$F$137","v":120},{"$f":"'Data Update Form'!$F$139","v":120},{"$f":"'Data Update Form'!$F$139","v":120},{"$f":"'Data Update Form'!$F$141","v":45},{"$f":"'Data Update Form'!$F$141","v":45},{"$f":"'Data Update Form'!$F$141","v":45},{"$f":"'Data Update Form'!$F$141","v":45},{"$f":"'Data Update Form'!$F$141","v":45},{"$f":"'Data Update Form'!$F$143","v":120},{"$f":"'Data Update Form'!$F$143","v":120},{"$f":"'Data Update Form'!$F$143","v":120},{"$f":"'Data Update Form'!$F$143","v":120},{"$f":"'Data Update Form'!$F$143","v":120},{"$f":"'Data Update Form'!$F$143","v":120},{"$f":"'Data Update Form'!$F$143","v":120},{"$f":"'Data Update Form'!$F$143","v":120},{"$f":"'Data Update Form'!$F$143","v":120},{"$f":"'Data Update Form'!$F$143","v":120},{"$f":"'Data Update Form'!$F$143","v":120},{"$f":"'Data Update Form'!$F$143","v":120},{"$f":"'Data Update Form'!$F$143","v":120},{"$f":"'Data Update Form'!$F$143","v":120},"Edible Beans",2901,9,{"$f":"'Data Update Form'!$F$134","v":0},{"$f":"'Data Update Form'!$F$136","v":30},null,{"$f":"'Data Update Form'!$F$138","v":90},{"$f":"'Data Update Form'!$F$140","v":90},{"$f":"'Data Update Form'!$F$140","v":90},{"$f":"'Data Update Form'!$F$142","v":25},{"$f":"'Data Update Form'!$F$142","v":25},{"$f":"'Data Update Form'!$F$142","v":25},{"$f":"'Data Update Form'!$F$142","v":25},{"$f":"'Data Update Form'!$F$142","v":25},{"$f":"'Data Update Form'!$F$144","v":90},{"$f":"'Data Update Form'!$F$144","v":90},{"$f":"'Data Update Form'!$F$144","v":90},{"$f":"'Data Update Form'!$F$144","v":90},{"$f":"'Data Update Form'!$F$144","v":90},{"$f":"'Data Update Form'!$F$144","v":90},{"$f":"'Data Update Form'!$F$144","v":90},{"$f":"'Data Update Form'!$F$144","v":90},{"$f":"'Data Update Form'!$F$144","v":90},{"$f":"'Data Update Form'!$F$144","v":90},{"$f":"'Data Update Form'!$F$144","v":90},{"$f":"'Data Update Form'!$F$144","v":90},{"$f":"'Data Update Form'!$F$144","v":90},{"$f":"'Data Update Form'!$F$144","v":90}]
[53]
[54,"Grass/Legume",0,12,null,null,null,null,null,null,null,null,null,null,null,null,null,null,null,null,null,null,null,null,null,null,null,null,null,"Grass/Legume",0,12]
[55]
[56,"Millet",0,13,{"$f":"'Data Update Form'!$C$153","v":0},{"$f":"'Data Update Form'!$C$155","v":0},null,{"$f":"'Data Update Form'!$C$157","v":0},{"$f":"'Data Update Form'!$C$159","v":20},{"$f":"'Data Update Form'!$C$159","v":20},{"$f":"'Data Update Form'!$C$161","v":0},{"$f":"'Data Update Form'!$C$161","v":0},{"$f":"'Data Update Form'!$C$161","v":0},{"$f":"'Data Update Form'!$C$161","v":0},{"$f":"'Data Update Form'!$C$161","v":0},{"$f":"'Data Update Form'!$C$163","v":40},{"$f":"'Data Update Form'!$C$163","v":40},{"$f":"'Data Update Form'!$C$163","v":40},{"$f":"'Data Update Form'!$C$163","v":40},{"$f":"'Data Update Form'!$C$163","v":40},{"$f":"'Data Update Form'!$C$163","v":40},{"$f":"'Data Update Form'!$C$163","v":40},{"$f":"'Data Update Form'!$C$163","v":40},{"$f":"'Data Update Form'!$C$163","v":40},{"$f":"'Data Update Form'!$C$163","v":40},{"$f":"'Data Update Form'!$C$163","v":40},{"$f":"'Data Update Form'!$C$163","v":40},{"$f":"'Data Update Form'!$C$163","v":40},{"$f":"'Data Update Form'!$C$163","v":40},"Millet",0,13,{"$f":"'Data Update Form'!$C$154","v":0},{"$f":"'Data Update Form'!$C$156","v":0},null,{"$f":"'Data Update Form'!$C$158","v":0},{"$f":"'Data Update Form'!$C$160","v":0},{"$f":"'Data Update Form'!$C$160","v":0},{"$f":"'Data Update Form'!$C$162","v":0},{"$f":"'Data Update Form'!$C$162","v":0},{"$f":"'Data Update Form'!$C$162","v":0},{"$f":"'Data Update Form'!$C$162","v":0},{"$f":"'Data Update Form'!$C$162","v":0},{"$f":"'Data Update Form'!$C$164","v":20},{"$f":"'Data Update Form'!$C$164","v":20},{"$f":"'Data Update Form'!$C$164","v":20},{"$f":"'Data Update Form'!$C$164","v":20},{"$f":"'Data Update Form'!$C$164","v":20},{"$f":"'Data Update Form'!$C$164","v":20},{"$f":"'Data Update Form'!$C$164","v":20},{"$f":"'Data Update Form'!$C$164","v":20},{"$f":"'Data Update Form'!$C$164","v":20},{"$f":"'Data Update Form'!$C$164","v":20},{"$f":"'Data Update Form'!$C$164","v":20},{"$f":"'Data Update Form'!$C$164","v":20},{"$f":"'Data Update Form'!$C$164","v":20},{"$f":"'Data Update Form'!$C$164","v":20}]
[57,"Millet",1901,13,{"$f":"'Data Update Form'!$D$153","v":0},{"$f":"'Data Update Form'!$D$155","v":10},null,{"$f":"'Data Update Form'!$D$157","v":10},{"$f":"'Data Update Form'!$D$159","v":30},{"$f":"'Data Update Form'!$D$159","v":30},{"$f":"'Data Update Form'!$D$161","v":0},{"$f":"'Data Update Form'!$D$161","v":0},{"$f":"'Data Update Form'!$D$161","v":0},{"$f":"'Data Update Form'!$D$161","v":0},{"$f":"'Data Update Form'!$D$161","v":0},{"$f":"'Data Update Form'!$D$163","v":50},{"$f":"'Data Update Form'!$D$163","v":50},{"$f":"'Data Update Form'!$D$163","v":50},{"$f":"'Data Update Form'!$D$163","v":50},{"$f":"'Data Update Form'!$D$163","v":50},{"$f":"'Data Update Form'!$D$163","v":50},{"$f":"'Data Update Form'!$D$163","v":50},{"$f":"'Data Update Form'!$D$163","v":50},{"$f":"'Data Update Form'!$D$163","v":50},{"$f":"'Data Update Form'!$D$163","v":50},{"$f":"'Data Update Form'!$D$163","v":50},{"$f":"'Data Update Form'!$D$163","v":50},{"$f":"'Data Update Form'!$D$163","v":50},{"$f":"'Data Update Form'!$D$163","v":50},"Millet",1901,13,{"$f":"'Data Update Form'!$D$154","v":0},{"$f":"'Data Update Form'!$D$156","v":0},null,{"$f":"'Data Update Form'!$D$158","v":0},{"$f":"'Data Update Form'!$D$160","v":10},{"$f":"'Data Update Form'!$D$160","v":10},{"$f":"'Data Update Form'!$D$162","v":0},{"$f":"'Data Update Form'!$D$162","v":0},{"$f":"'Data Update Form'!$D$162","v":0},{"$f":"'Data Update Form'!$D$162","v":0},{"$f":"'Data Update Form'!$D$162","v":0},{"$f":"'Data Update Form'!$D$164","v":30},{"$f":"'Data Update Form'!$D$164","v":30},{"$f":"'Data Update Form'!$D$164","v":30},{"$f":"'Data Update Form'!$D$164","v":30},{"$f":"'Data Update Form'!$D$164","v":30},{"$f":"'Data Update Form'!$D$164","v":30},{"$f":"'Data Update Form'!$D$164","v":30},{"$f":"'Data Update Form'!$D$164","v":30},{"$f":"'Data Update Form'!$D$164","v":30},{"$f":"'Data Update Form'!$D$164","v":30},{"$f":"'Data Update Form'!$D$164","v":30},{"$f":"'Data Update Form'!$D$164","v":30},{"$f":"'Data Update Form'!$D$164","v":30},{"$f":"'Data Update Form'!$D$164","v":30}]
[58,"Millet",2301,13,{"$f":"'Data Update Form'!$E$153","v":0},{"$f":"'Data Update Form'!$E$155","v":20},null,{"$f":"'Data Update Form'!$E$157","v":20},{"$f":"'Data Update Form'!$E$159","v":40},{"$f":"'Data Update Form'!$E$159","v":40},{"$f":"'Data Update Form'!$E$161","v":0},{"$f":"'Data Update Form'!$E$161","v":0},{"$f":"'Data Update Form'!$E$161","v":0},{"$f":"'Data Update Form'!$E$161","v":0},{"$f":"'Data Update Form'!$E$161","v":0},{"$f":"'Data Update Form'!$E$163","v":60},{"$f":"'Data Update Form'!$E$163","v":60},{"$f":"'Data Update Form'!$E$163","v":60},{"$f":"'Data Update Form'!$E$163","v":60},{"$f":"'Data Update Form'!$E$163","v":60},{"$f":"'Data Update Form'!$E$163","v":60},{"$f":"'Data Update Form'!$E$163","v":60},{"$f":"'Data Update Form'!$E$163","v":60},{"$f":"'Data Update Form'!$E$163","v":60},{"$f":"'Data Update Form'!$E$163","v":60},{"$f":"'Data Update Form'!$E$163","v":60},{"$f":"'Data Update Form'!$E$163","v":60},{"$f":"'Data Update Form'!$E$163","v":60},{"$f":"'Data Update Form'!$E$163","v":60},"Millet",2301,13,{"$f":"'Data Update Form'!$E$154","v":0},{"$f":"'Data Update Form'!$E$156","v":0},null,{"$f":"'Data Update Form'!$E$158","v":0},{"$f":"'Data Update Form'!$E$160","v":20},{"$f":"'Data Update Form'!$E$160","v":20},{"$f":"'Data Update Form'!$E$162","v":0},{"$f":"'Data Update Form'!$E$162","v":0},{"$f":"'Data Update Form'!$E$162","v":0},{"$f":"'Data Update Form'!$E$162","v":0},{"$f":"'Data Update Form'!$E$162","v":0},{"$f":"'Data Update Form'!$E$164","v":40},{"$f":"'Data Update Form'!$E$164","v":40},{"$f":"'Data Update Form'!$E$164","v":40},{"$f":"'Data Update Form'!$E$164","v":40},{"$f":"'Data Update Form'!$E$164","v":40},{"$f":"'Data Update Form'!$E$164","v":40},{"$f":"'Data Update Form'!$E$164","v":40},{"$f":"'Data Update Form'!$E$164","v":40},{"$f":"'Data Update Form'!$E$164","v":40},{"$f":"'Data Update Form'!$E$164","v":40},{"$f":"'Data Update Form'!$E$164","v":40},{"$f":"'Data Update Form'!$E$164","v":40},{"$f":"'Data Update Form'!$E$164","v":40},{"$f":"'Data Update Form'!$E$164","v":40}]
[59,"Millet",2701,13,{"$f":"'Data Update Form'!$F$153","v":0},{"$f":"'Data Update Form'!$F$155","v":40},null,{"$f":"'Data Update Form'!$F$157","v":40},{"$f":"'Data Update Form'!$F$159","v":60},{"$f":"'Data Update Form'!$F$159","v":60},{"$f":"'Data Update Form'!$F$161","v":0},{"$f":"'Data Update Form'!$F$161","v":0},{"$f":"'Data Update Form'!$F$161","v":0},{"$f":"'Data Update Form'!$F$161","v":0},{"$f":"'Data Update Form'!$F$161","v":0},{"$f":"'Data Update Form'!$F$163","v":80},{"$f":"'Data Update Form'!$F$163","v":80},{"$f":"'Data Update Form'!$F$163","v":80},{"$f":"'Data Update Form'!$F$163","v":80},{"$f":"'Data Update Form'!$F$163","v":80},{"$f":"'Data Update Form'!$F$163","v":80},{"$f":"'Data Update Form'!$F$163","v":80},{"$f":"'Data Update Form'!$F$163","v":80},{"$f":"'Data Update Form'!$F$163","v":80},{"$f":"'Data Update Form'!$F$163","v":80},{"$f":"'Data Update Form'!$F$163","v":80},{"$f":"'Data Update Form'!$F$163","v":80},{"$f":"'Data Update Form'!$F$163","v":80},{"$f":"'Data Update Form'!$F$163","v":80},"Millet",2701,13,{"$f":"'Data Update Form'!$F$154","v":0},{"$f":"'Data Update Form'!$F$156","v":20},null,{"$f":"'Data Update Form'!$F$158","v":20},{"$f":"'Data Update Form'!$F$160","v":40},{"$f":"'Data Update Form'!$F$160","v":40},{"$f":"'Data Update Form'!$F$162","v":0},{"$f":"'Data Update Form'!$F$162","v":0},{"$f":"'Data Update Form'!$F$162","v":0},{"$f":"'Data Update Form'!$F$162","v":0},{"$f":"'Data Update Form'!$F$162","v":0},{"$f":"'Data Update Form'!$F$164","v":60},{"$f":"'Data Update Form'!$F$164","v":60},{"$f":"'Data Update Form'!$F$164","v":60},{"$f":"'Data Update Form'!$F$164","v":60},{"$f":"'Data Update Form'!$F$164","v":60},{"$f":"'Data Update Form'!$F$164","v":60},{"$f":"'Data Update Form'!$F$164","v":60},{"$f":"'Data Update Form'!$F$164","v":60},{"$f":"'Data Update Form'!$F$164","v":60},{"$f":"'Data Update Form'!$F$164","v":60},{"$f":"'Data Update Form'!$F$164","v":60},{"$f":"'Data Update Form'!$F$164","v":60},{"$f":"'Data Update Form'!$F$164","v":60},{"$f":"'Data Update Form'!$F$164","v":60}]
[60,"Millet",3100,13,{"$f":"'Data Update Form'!$G$153","v":0},{"$f":"'Data Update Form'!$G$155","v":60},null,{"$f":"'Data Update Form'!$G$157","v":60},{"$f":"'Data Update Form'!$G$159","v":80},{"$f":"'Data Update Form'!$G$159","v":80},{"$f":"'Data Update Form'!$G$161","v":25},{"$f":"'Data Update Form'!$G$161","v":25},{"$f":"'Data Update Form'!$G$161","v":25},{"$f":"'Data Update Form'!$G$161","v":25},{"$f":"'Data Update Form'!$G$161","v":25},{"$f":"'Data Update Form'!$G$163","v":100},{"$f":"'Data Update Form'!$G$163","v":100},{"$f":"'Data Update Form'!$G$163","v":100},{"$f":"'Data Update Form'!$G$163","v":100},{"$f":"'Data Update Form'!$G$163","v":100},{"$f":"'Data Update Form'!$G$163","v":100},{"$f":"'Data Update Form'!$G$163","v":100},{"$f":"'Data Update Form'!$G$163","v":100},{"$f":"'Data Update Form'!$G$163","v":100},{"$f":"'Data Update Form'!$G$163","v":100},{"$f":"'Data Update Form'!$G$163","v":100},{"$f":"'Data Update Form'!$G$163","v":100},{"$f":"'Data Update Form'!$G$163","v":100},{"$f":"'Data Update Form'!$G$163","v":100},"Millet",3100,13,{"$f":"'Data Update Form'!$G$154","v":0},{"$f":"'Data Update Form'!$G$156","v":40},null,{"$f":"'Data Update Form'!$G$158","v":40},{"$f":"'Data Update Form'!$G$160","v":60},{"$f":"'Data Update Form'!$G$160","v":60},{"$f":"'Data Update Form'!$G$162","v":0},{"$f":"'Data Update Form'!$G$162","v":0},{"$f":"'Data Update Form'!$G$162","v":0},{"$f":"'Data Update Form'!$G$162","v":0},{"$f":"'Data Update Form'!$G$162","v":0},{"$f":"'Data Update Form'!$G$164","v":80},{"$f":"'Data Update Form'!$G$164","v":80},{"$f":"'Data Update Form'!$G$164","v":80},{"$f":"'Data Update Form'!$G$164","v":80},{"$f":"'Data Update Form'!$G$164","v":80},{"$f":"'Data Update Form'!$G$164","v":80},{"$f":"'Data Update Form'!$G$164","v":80},{"$f":"'Data Update Form'!$G$164","v":80},{"$f":"'Data Update Form'!$G$164","v":80},{"$f":"'Data Update Form'!$G$164","v":80},{"$f":"'Data Update Form'!$G$164","v":80},{"$f":"'Data Update Form'!$G$164","v":80},{"$f":"'Data Update Form'!$G$164","v":80},{"$f":"'Data Update Form'!$G$164","v":80}]
[61]
[62,"Alsike Clover",0,7,null,null,null,null,null,null,null,null,null,null,null,null,null,null,null,null,null,null,null,null,null,null,null,null,null,"Alsike Clover",0,7]
[63,"Birdsfoot Trefoil",0,7,null,null,null,null,null,null,null,null,null,null,null,null,null,null,null,null,null,null,null,null,null,null,null,null,null,"Birdsfoot Trefoil",0,7]
[64,"Red Clover",0,7,null,null,null,null,null,null,null,null,null,null,null,null,null,null,null,null,null,null,null,null,null,null,null,null,null,"Red Clover",0,7]
[65]
[66,"Rye",0,18,{"$f":"'Data Update Form'!$C$173","v":0},{"$f":"'Data Update Form'!$C$175","v":40},null,{"$f":"'Data Update Form'!$C$177","v":40},{"$f":"'Data Update Form'!$C$179","v":50},{"$f":"'Data Update Form'!$C$179","v":50},{"$f":"'Data Update Form'!$C$181","v":0},{"$f":"'Data Update Form'!$C$181","v":0},{"$f":"'Data Update Form'!$C$181","v":0},{"$f":"'Data Update Form'!$C$181","v":0},{"$f":"'Data Update Form'!$C$181","v":0},{"$f":"'Data Update Form'!$C$183","v":60},{"$f":"'Data Update Form'!$C$183","v":60},{"$f":"'Data Update Form'!$C$183","v":60},{"$f":"'Data Update Form'!$C$183","v":60},{"$f":"'Data Update Form'!$C$183","v":60},{"$f":"'Data Update Form'!$C$183","v":60},{"$f":"'Data Update Form'!$C$183","v":60},{"$f":"'Data Update Form'!$C$183","v":60},{"$f":"'Data Update Form'!$C$183","v":60},{"$f":"'Data Update Form'!$C$183","v":60},{"$f":"'Data Update Form'!$C$183","v":60},{"$f":"'Data Update Form'!$C$183","v":60},{"$f":"'Data Update Form'!$C$183","v":60},{"$f":"'Data Update Form'!$C$183","v":60},"Rye",0,18,{"$f":"'Data Update Form'!$C$174","v":0},{"$f":"'Data Update Form'!$C$176","v":20},null,{"$f":"'Data Update Form'!$C$178","v":20},{"$f":"'Data Update Form'!$C$180","v":30},{"$f":"'Data Update Form'!$C$180","v":30},{"$f":"'Data Update Form'!$C$182","v":0},{"$f":"'Data Update Form'!$C$182","v":0},{"$f":"'Data Update Form'!$C$182","v":0},{"$f":"'Data Update Form'!$C$182","v":0},{"$f":"'Data Update Form'!$C$182","v":0},{"$f":"'Data Update Form'!$C$184","v":40},{"$f":"'Data Update Form'!$C$184","v":40},{"$f":"'Data Update Form'!$C$184","v":40},{"$f":"'Data Update Form'!$C$184","v":40},{"$f":"'Data Update Form'!$C$184","v":40},{"$f":"'Data Update Form'!$C$184","v":40},{"$f":"'Data Update Form'!$C$184","v":40},{"$f":"'Data Update Form'!$C$184","v":40},{"$f":"'Data Update Form'!$C$184","v":40},{"$f":"'Data Update Form'!$C$184","v":40},{"$f":"'Data Update Form'!$C$184","v":40},{"$f":"'Data Update Form'!$C$184","v":40},{"$f":"'Data Update Form'!$C$184","v":40},{"$f":"'Data Update Form'!$C$184","v":40}]
[67,"Rye",50,18,{"$f":"'Data Update Form'!$D$173","v":0},{"$f":"'Data Update Form'!$D$175","v":65},null,{"$f":"'Data Update Form'!$D$177","v":65},{"$f":"'Data Update Form'!$D$179","v":75},{"$f":"'Data Update Form'!$D$179","v":75},{"$f":"'Data Update Form'!$D$181","v":35},{"$f":"'Data Update Form'!$D$181","v":35},{"$f":"'Data Update Form'!$D$181","v":35},{"$f":"'Data Update Form'!$D$181","v":35},{"$f":"'Data Update Form'!$D$181","v":35},{"$f":"'Data Update Form'!$D$183","v":85},{"$f":"'Data Update Form'!$D$183","v":85},{"$f":"'Data Update Form'!$D$183","v":85},{"$f":"'Data Update Form'!$D$183","v":85},{"$f":"'Data Update Form'!$D$183","v":85},{"$f":"'Data Update Form'!$D$183","v":85},{"$f":"'Data Update Form'!$D$183","v":85},{"$f":"'Data Update Form'!$D$183","v":85},{"$f":"'Data Update Form'!$D$183","v":85},{"$f":"'Data Update Form'!$D$183","v":85},{"$f":"'Data Update Form'!$D$183","v":85},{"$f":"'Data Update Form'!$D$183","v":85},{"$f":"'Data Update Form'!$D$183","v":85},{"$f":"'Data Update Form'!$D$183","v":85},"Rye",50,18,{"$f":"'Data Update Form'!$D$174","v":0},{"$f":"'Data Update Form'!$D$176","v":45},null,{"$f":"'Data Update Form'!$D$178","v":45},{"$f":"'Data Update Form'!$D$180","v":55},{"$f":"'Data Update Form'!$D$180","v":55},{"$f":"'Data Update Form'!$D$182","v":0},{"$f":"'Data Update Form'!$D$182","v":0},{"$f":"'Data Update Form'!$D$182","v":0},{"$f":"'Data Update Form'!$D$182","v":0},{"$f":"'Data Update Form'!$D$182","v":0},{"$f":"'Data Update Form'!$D$184","v":65},{"$f":"'Data Update Form'!$D$184","v":65},{"$f":"'Data Update Form'!$D$184","v":65},{"$f":"'Data Update Form'!$D$184","v":65},{"$f":"'Data Update Form'!$D$184","v":65},{"$f":"'Data Update Form'!$D$184","v":65},{"$f":"'Data Update Form'!$D$184","v":65},{"$f":"'Data Update Form'!$D$184","v":65},{"$f":"'Data Update Form'!$D$184","v":65},{"$f":"'Data Update Form'!$D$184","v":65},{"$f":"'Data Update Form'!$D$184","v":65},{"$f":"'Data Update Form'!$D$184","v":65},{"$f":"'Data Update Form'!$D$184","v":65},{"$f":"'Data Update Form'!$D$184","v":65}]
[68,"Rye",60,18,{"$f":"'Data Update Form'!$E$173","v":40},{"$f":"'Data Update Form'!$E$175","v":90},null,{"$f":"'Data Update Form'!$E$177","v":90},{"$f":"'Data Update Form'!$E$179","v":100},{"$f":"'Data Update Form'!$E$179","v":100},{"$f":"'Data Update Form'!$E$181","v":60},{"$f":"'Data Update Form'!$E$181","v":60},{"$f":"'Data Update Form'!$E$181","v":60},{"$f":"'Data Update Form'!$E$181","v":60},{"$f":"'Data Update Form'!$E$181","v":60},{"$f":"'Data Update Form'!$E$183","v":110},{"$f":"'Data Update Form'!$E$183","v":110},{"$f":"'Data Update Form'!$E$183","v":110},{"$f":"'Data Update Form'!$E$183","v":110},{"$f":"'Data Update Form'!$E$183","v":110},{"$f":"'Data Update Form'!$E$183","v":110},{"$f":"'Data Update Form'!$E$183","v":110},{"$f":"'Data Update Form'!$E$183","v":110},{"$f":"'Data Update Form'!$E$183","v":110},{"$f":"'Data Update Form'!$E$183","v":110},{"$f":"'Data Update Form'!$E$183","v":110},{"$f":"'Data Update Form'!$E$183","v":110},{"$f":"'Data Update Form'!$E$183","v":110},{"$f":"'Data Update Form'!$E$183","v":110},"Rye",60,18,{"$f":"'Data Update Form'!$E$174","v":20},{"$f":"'Data Update Form'!$E$176","v":70},null,{"$f":"'Data Update Form'!$E$178","v":70},{"$f":"'Data Update Form'!$E$180","v":80},{"$f":"'Data Update Form'!$E$180","v":80},{"$f":"'Data Update Form'!$E$182","v":40},{"$f":"'Data Update Form'!$E$182","v":40},{"$f":"'Data Update Form'!$E$182","v":40},{"$f":"'Data Update Form'!$E$182","v":40},{"$f":"'Data Update Form'!$E$182","v":40},{"$f":"'Data Update Form'!$E$184","v":90},{"$f":"'Data Update Form'!$E$184","v":90},{"$f":"'Data Update Form'!$E$184","v":90},{"$f":"'Data Update Form'!$E$184","v":90},{"$f":"'Data Update Form'!$E$184","v":90},{"$f":"'Data Update Form'!$E$184","v":90},{"$f":"'Data Update Form'!$E$184","v":90},{"$f":"'Data Update Form'!$E$184","v":90},{"$f":"'Data Update Form'!$E$184","v":90},{"$f":"'Data Update Form'!$E$184","v":90},{"$f":"'Data Update Form'!$E$184","v":90},{"$f":"'Data Update Form'!$E$184","v":90},{"$f":"'Data Update Form'!$E$184","v":90},{"$f":"'Data Update Form'!$E$184","v":90}]
[69,"Rye",70,18,{"$f":"'Data Update Form'!$F$173","v":65},{"$f":"'Data Update Form'!$F$175","v":115},null,{"$f":"'Data Update Form'!$F$177","v":115},{"$f":"'Data Update Form'!$F$179","v":125},{"$f":"'Data Update Form'!$F$179","v":125},{"$f":"'Data Update Form'!$F$181","v":85},{"$f":"'Data Update Form'!$F$181","v":85},{"$f":"'Data Update Form'!$F$181","v":85},{"$f":"'Data Update Form'!$F$181","v":85},{"$f":"'Data Update Form'!$F$181","v":85},{"$f":"'Data Update Form'!$F$183","v":135},{"$f":"'Data Update Form'!$F$183","v":135},{"$f":"'Data Update Form'!$F$183","v":135},{"$f":"'Data Update Form'!$F$183","v":135},{"$f":"'Data Update Form'!$F$183","v":135},{"$f":"'Data Update Form'!$F$183","v":135},{"$f":"'Data Update Form'!$F$183","v":135},{"$f":"'Data Update Form'!$F$183","v":135},{"$f":"'Data Update Form'!$F$183","v":135},{"$f":"'Data Update Form'!$F$183","v":135},{"$f":"'Data Update Form'!$F$183","v":135},{"$f":"'Data Update Form'!$F$183","v":135},{"$f":"'Data Update Form'!$F$183","v":135},{"$f":"'Data Update Form'!$F$183","v":135},"Rye",70,18,{"$f":"'Data Update Form'!$F$174","v":45},{"$f":"'Data Update Form'!$F$176","v":95},null,{"$f":"'Data Update Form'!$F$178","v":95},{"$f":"'Data Update Form'!$F$180","v":105},{"$f":"'Data Update Form'!$F$180","v":105},{"$f":"'Data Update Form'!$F$182","v":65},{"$f":"'Data Update Form'!$F$182","v":65},{"$f":"'Data Update Form'!$F$182","v":65},{"$f":"'Data Update Form'!$F$182","v":65},{"$f":"'Data Update Form'!$F$182","v":65},{"$f":"'Data Update Form'!$F$184","v":115},{"$f":"'Data Update Form'!$F$184","v":115},{"$f":"'Data Update Form'!$F$184","v":115},{"$f":"'Data Update Form'!$F$184","v":115},{"$f":"'Data Update Form'!$F$184","v":115},{"$f":"'Data Update Form'!$F$184","v":115},{"$f":"'Data Update Form'!$F$184","v":115},{"$f":"'Data Update Form'!$F$184","v":115},{"$f":"'Data Update Form'!$F$184","v":115},{"$f":"'Data Update Form'!$F$184","v":115},{"$f":"'Data Update Form'!$F$184","v":115},{"$f":"'Data Update Form'!$F$184","v":115},{"$f":"'Data Update Form'!$F$184","v":115},{"$f":"'Data Update Form'!$F$184","v":115}]
[70,"Rye",80,18,{"$f":"'Data Update Form'!$G$173","v":95},{"$f":"'Data Update Form'!$G$175","v":140},null,{"$f":"'Data Update Form'!$G$177","v":140},{"$f":"'Data Update Form'!$G$179","v":150},{"$f":"'Data Update Form'!$G$179","v":150},{"$f":"'Data Update Form'!$G$181","v":110},{"$f":"'Data Update Form'!$G$181","v":110},{"$f":"'Data Update Form'!$G$181","v":110},{"$f":"'Data Update Form'!$G$181","v":110},{"$f":"'Data Update Form'!$G$181","v":110},{"$f":"'Data Update Form'!$G$183","v":160},{"$f":"'Data Update Form'!$G$183","v":160},{"$f":"'Data Update Form'!$G$183","v":160},{"$f":"'Data Update Form'!$G$183","v":160},{"$f":"'Data Update Form'!$G$183","v":160},{"$f":"'Data Update Form'!$G$183","v":160},{"$f":"'Data Update Form'!$G$183","v":160},{"$f":"'Data Update Form'!$G$183","v":160},{"$f":"'Data Update Form'!$G$183","v":160},{"$f":"'Data Update Form'!$G$183","v":160},{"$f":"'Data Update Form'!$G$183","v":160},{"$f":"'Data Update Form'!$G$183","v":160},{"$f":"'Data Update Form'!$G$183","v":160},{"$f":"'Data Update Form'!$G$183","v":160},"Rye",80,18,{"$f":"'Data Update Form'!$G$174","v":75},{"$f":"'Data Update Form'!$G$176","v":120},null,{"$f":"'Data Update Form'!$G$178","v":120},{"$f":"'Data Update Form'!$G$180","v":130},{"$f":"'Data Update Form'!$G$180","v":130},{"$f":"'Data Update Form'!$G$182","v":90},{"$f":"'Data Update Form'!$G$182","v":90},{"$f":"'Data Update Form'!$G$182","v":90},{"$f":"'Data Update Form'!$G$182","v":90},{"$f":"'Data Update Form'!$G$182","v":90},{"$f":"'Data Update Form'!$G$184","v":140},{"$f":"'Data Update Form'!$G$184","v":140},{"$f":"'Data Update Form'!$G$184","v":140},{"$f":"'Data Update Form'!$G$184","v":140},{"$f":"'Data Update Form'!$G$184","v":140},{"$f":"'Data Update Form'!$G$184","v":140},{"$f":"'Data Update Form'!$G$184","v":140},{"$f":"'Data Update Form'!$G$184","v":140},{"$f":"'Data Update Form'!$G$184","v":140},{"$f":"'Data Update Form'!$G$184","v":140},{"$f":"'Data Update Form'!$G$184","v":140},{"$f":"'Data Update Form'!$G$184","v":140},{"$f":"'Data Update Form'!$G$184","v":140},{"$f":"'Data Update Form'!$G$184","v":140}]
[71]
[72,"Sugarbeets",null,21,null,null,null,null,null,null,null,null,null,null,null,null,null,null,null,null,null,null,null,null,null,null,null,null,null,"Sugarbeets",null,21]
[73]
[74,"Sunflowers",0,22,{"$f":"'Data Update Form'!$C$193","v":0},{"$f":"'Data Update Form'!$C$195","v":30},null,{"$f":"'Data Update Form'!$C$197","v":30},{"$f":"'Data Update Form'!$C$199","v":0},{"$f":"'Data Update Form'!$C$199","v":0},{"$f":"'Data Update Form'!$C$201","v":0},{"$f":"'Data Update Form'!$C$201","v":0},{"$f":"'Data Update Form'!$C$201","v":0},{"$f":"'Data Update Form'!$C$201","v":0},{"$f":"'Data Update Form'!$C$201","v":0},{"$f":"'Data Update Form'!$C$203","v":70},{"$f":"'Data Update Form'!$C$203","v":70},{"$f":"'Data Update Form'!$C$203","v":70},{"$f":"'Data Update Form'!$C$203","v":70},{"$f":"'Data Update Form'!$C$203","v":70},{"$f":"'Data Update Form'!$C$203","v":70},{"$f":"'Data Update Form'!$C$203","v":70},{"$f":"'Data Update Form'!$C$203","v":70},{"$f":"'Data Update Form'!$C$203","v":70},{"$f":"'Data Update Form'!$C$203","v":70},{"$f":"'Data Update Form'!$C$203","v":70},{"$f":"'Data Update Form'!$C$203","v":70},{"$f":"'Data Update Form'!$C$203","v":70},{"$f":"'Data Update Form'!$C$203","v":70},"Sunflowers",0,22,{"$f":"'Data Update Form'!$C$194","v":0},{"$f":"'Data Update Form'!$C$196","v":0},null,{"$f":"'Data Update Form'!$C$198","v":0},{"$f":"'Data Update Form'!$C$200","v":0},{"$f":"'Data Update Form'!$C$200","v":0},{"$f":"'Data Update Form'!$C$202","v":0},{"$f":"'Data Update Form'!$C$202","v":0},{"$f":"'Data Update Form'!$C$202","v":0},{"$f":"'Data Update Form'!$C$202","v":0},{"$f":"'Data Update Form'!$C$202","v":0},{"$f":"'Data Update Form'!$C$204","v":40},{"$f":"'Data Update Form'!$C$204","v":40},{"$f":"'Data Update Form'!$C$204","v":40},{"$f":"'Data Update Form'!$C$204","v":40},{"$f":"'Data Update Form'!$C$204","v":40},{"$f":"'Data Update Form'!$C$204","v":40},{"$f":"'Data Update Form'!$C$204","v":40},{"$f":"'Data Update Form'!$C$204","v":40},{"$f":"'Data Update Form'!$C$204","v":40},{"$f":"'Data Update Form'!$C$204","v":40},{"$f":"'Data Update Form'!$C$204","v":40},{"$f":"'Data Update Form'!$C$204","v":40},{"$f":"'Data Update Form'!$C$204","v":40},{"$f":"'Data Update Form'!$C$204","v":40}]
[75,"Sunflowers",1901,22,{"$f":"'Data Update Form'!$D$193","v":0},{"$f":"'Data Update Form'!$D$195","v":50},null,{"$f":"'Data Update Form'!$D$197","v":50},{"$f":"'Data Update Form'!$D$199","v":0},{"$f":"'Data Update Form'!$D$199","v":0},{"$f":"'Data Update Form'!$D$201","v":15},{"$f":"'Data Update Form'!$D$201","v":15},{"$f":"'Data Update Form'!$D$201","v":15},{"$f":"'Data Update Form'!$D$201","v":15},{"$f":"'Data Update Form'!$D$201","v":15},{"$f":"'Data Update Form'!$D$203","v":90},{"$f":"'Data Update Form'!$D$203","v":90},{"$f":"'Data Update Form'!$D$203","v":90},{"$f":"'Data Update Form'!$D$203","v":90},{"$f":"'Data Update Form'!$D$203","v":90},{"$f":"'Data Update Form'!$D$203","v":90},{"$f":"'Data Update Form'!$D$203","v":90},{"$f":"'Data Update Form'!$D$203","v":90},{"$f":"'Data Update Form'!$D$203","v":90},{"$f":"'Data Update Form'!$D$203","v":90},{"$f":"'Data Update Form'!$D$203","v":90},{"$f":"'Data Update Form'!$D$203","v":90},{"$f":"'Data Update Form'!$D$203","v":90},{"$f":"'Data Update Form'!$D$203","v":90},"Sunflowers",1901,22,{"$f":"'Data Update Form'!$D$194","v":0},{"$f":"'Data Update Form'!$D$196","v":20},null,{"$f":"'Data Update Form'!$D$198","v":20},{"$f":"'Data Update Form'!$D$200","v":0},{"$f":"'Data Update Form'!$D$200","v":0},{"$f":"'Data Update Form'!$D$202","v":0},{"$f":"'Data Update Form'!$D$202","v":0},{"$f":"'Data Update Form'!$D$202","v":0},{"$f":"'Data Update Form'!$D$202","v":0},{"$f":"'Data Update Form'!$D$202","v":0},{"$f":"'Data Update Form'!$D$204","v":60},{"$f":"'Data Update Form'!$D$204","v":60},{"$f":"'Data Update Form'!$D$204","v":60},{"$f":"'Data Update Form'!$D$204","v":60},{"$f":"'Data Update Form'!$D$204","v":60},{"$f":"'Data Update Form'!$D$204","v":60},{"$f":"'Data Update Form'!$D$204","v":60},{"$f":"'Data Update Form'!$D$204","v":60},{"$f":"'Data Update Form'!$D$204","v":60},{"$f":"'Data Update Form'!$D$204","v":60},{"$f":"'Data Update Form'!$D$204","v":60},{"$f":"'Data Update Form'!$D$204","v":60},{"$f":"'Data Update Form'!$D$204","v":60},{"$f":"'Data Update Form'!$D$204","v":60}]
[76,"Sunflowers",2401,22,{"$f":"'Data Update Form'!$E$193","v":0},{"$f":"'Data Update Form'!$E$195","v":70},null,{"$f":"'Data Update Form'!$E$197","v":70},{"$f":"'Data Update Form'!$E$199","v":0},{"$f":"'Data Update Form'!$E$199","v":0},{"$f":"'Data Update Form'!$E$201","v":25},{"$f":"'Data Update Form'!$E$201","v":25},{"$f":"'Data Update Form'!$E$201","v":25},{"$f":"'Data Update Form'!$E$201","v":25},{"$f":"'Data Update Form'!$E$201","v":25},{"$f":"'Data Update Form'!$E$203","v":110},{"$f":"'Data Update Form'!$E$203","v":110},{"$f":"'Data Update Form'!$E$203","v":110},{"$f":"'Data Update Form'!$E$203","v":110},{"$f":"'Data Update Form'!$E$203","v":110},{"$f":"'Data Update Form'!$E$203","v":110},{"$f":"'Data Update Form'!$E$203","v":110},{"$f":"'Data Update Form'!$E$203","v":110},{"$f":"'Data Update Form'!$E$203","v":110},{"$f":"'Data Update Form'!$E$203","v":110},{"$f":"'Data Update Form'!$E$203","v":110},{"$f":"'Data Update Form'!$E$203","v":110},{"$f":"'Data Update Form'!$E$203","v":110},{"$f":"'Data Update Form'!$E$203","v":110},"Sunflowers",2401,22,{"$f":"'Data Update Form'!$E$194","v":0},{"$f":"'Data Update Form'!$E$196","v":40},null,{"$f":"'Data Update Form'!$E$198","v":40},{"$f":"'Data Update Form'!$E$200","v":0},{"$f":"'Data Update Form'!$E$200","v":0},{"$f":"'Data Update Form'!$E$202","v":0},{"$f":"'Data Update Form'!$E$202","v":0},{"$f":"'Data Update Form'!$E$202","v":0},{"$f":"'Data Update Form'!$E$202","v":0},{"$f":"'Data Update Form'!$E$202","v":0},{"$f":"'Data Update Form'!$E$204","v":80},{"$f":"'Data Update Form'!$E$204","v":80},{"$f":"'Data Update Form'!$E$204","v":80},{"$f":"'Data Update Form'!$E$204","v":80},{"$f":"'Data Update Form'!$E$204","v":80},{"$f":"'Data Update Form'!$E$204","v":80},{"$f":"'Data Update Form'!$E$204","v":80},{"$f":"'Data Update Form'!$E$204","v":80},{"$f":"'Data Update Form'!$E$204","v":80},{"$f":"'Data Update Form'!$E$204","v":80},{"$f":"'Data Update Form'!$E$204","v":80},{"$f":"'Data Update Form'!$E$204","v":80},{"$f":"'Data Update Form'!$E$204","v":80},{"$f":"'Data Update Form'!$E$204","v":80}]
[77,"Sunflowers",2901,22,{"$f":"'Data Update Form'!$F$193","v":0},{"$f":"'Data Update Form'!$F$195","v":90},null,{"$f":"'Data Update Form'!$F$197","v":90},{"$f":"'Data Update Form'!$F$199","v":0},{"$f":"'Data Update Form'!$F$199","v":0},{"$f":"'Data Update Form'!$F$201","v":45},{"$f":"'Data Update Form'!$F$201","v":45},{"$f":"'Data Update Form'!$F$201","v":45},{"$f":"'Data Update Form'!$F$201","v":45},{"$f":"'Data Update Form'!$F$201","v":45},{"$f":"'Data Update Form'!$F$203","v":130},{"$f":"'Data Update Form'!$F$203","v":130},{"$f":"'Data Update Form'!$F$203","v":130},{"$f":"'Data Update Form'!$F$203","v":130},{"$f":"'Data Update Form'!$F$203","v":130},{"$f":"'Data Update Form'!$F$203","v":130},{"$f":"'Data Update Form'!$F$203","v":130},{"$f":"'Data Update Form'!$F$203","v":130},{"$f":"'Data Update Form'!$F$203","v":130},{"$f":"'Data Update Form'!$F$203","v":130},{"$f":"'Data Update Form'!$F$203","v":130},{"$f":"'Data Update Form'!$F$203","v":130},{"$f":"'Data Update Form'!$F$203","v":130},{"$f":"'Data Update Form'!$F$203","v":130},"Sunflowers",2901,22,{"$f":"'Data Update Form'!$F$194","v":0},{"$f":"'Data Update Form'!$F$196","v":60},null,{"$f":"'Data Update Form'!$F$198","v":60},{"$f":"'Data Update Form'!$F$200","v":0},{"$f":"'Data Update Form'!$F$200","v":0},{"$f":"'Data Update Form'!$F$202","v":25},{"$f":"'Data Update Form'!$F$202","v":25},{"$f":"'Data Update Form'!$F$202","v":25},{"$f":"'Data Update Form'!$F$202","v":25},{"$f":"'Data Update Form'!$F$202","v":25},{"$f":"'Data Update Form'!$F$204","v":100},{"$f":"'Data Update Form'!$F$204","v":100},{"$f":"'Data Update Form'!$F$204","v":100},{"$f":"'Data Update Form'!$F$204","v":100},{"$f":"'Data Update Form'!$F$204","v":100},{"$f":"'Data Update Form'!$F$204","v":100},{"$f":"'Data Update Form'!$F$204","v":100},{"$f":"'Data Update Form'!$F$204","v":100},{"$f":"'Data Update Form'!$F$204","v":100},{"$f":"'Data Update Form'!$F$204","v":100},{"$f":"'Data Update Form'!$F$204","v":100},{"$f":"'Data Update Form'!$F$204","v":100},{"$f":"'Data Update Form'!$F$204","v":100},{"$f":"'Data Update Form'!$F$204","v":100}]
[78,"Sunflowers",3300,22,{"$f":"'Data Update Form'!$G$193","v":0},{"$f":"'Data Update Form'!$G$195","v":110},null,{"$f":"'Data Update Form'!$G$197","v":110},{"$f":"'Data Update Form'!$G$199","v":0},{"$f":"'Data Update Form'!$G$199","v":0},{"$f":"'Data Update Form'!$G$201","v":65},{"$f":"'Data Update Form'!$G$201","v":65},{"$f":"'Data Update Form'!$G$201","v":65},{"$f":"'Data Update Form'!$G$201","v":65},{"$f":"'Data Update Form'!$G$201","v":65},{"$f":"'Data Update Form'!$G$203","v":150},{"$f":"'Data Update Form'!$G$203","v":150},{"$f":"'Data Update Form'!$G$203","v":150},{"$f":"'Data Update Form'!$G$203","v":150},{"$f":"'Data Update Form'!$G$203","v":150},{"$f":"'Data Update Form'!$G$203","v":150},{"$f":"'Data Update Form'!$G$203","v":150},{"$f":"'Data Update Form'!$G$203","v":150},{"$f":"'Data Update Form'!$G$203","v":150},{"$f":"'Data Update Form'!$G$203","v":150},{"$f":"'Data Update Form'!$G$203","v":150},{"$f":"'Data Update Form'!$G$203","v":150},{"$f":"'Data Update Form'!$G$203","v":150},{"$f":"'Data Update Form'!$G$203","v":150},"Sunflowers",3300,22,{"$f":"'Data Update Form'!$G$194","v":0},{"$f":"'Data Update Form'!$G$196","v":80},null,{"$f":"'Data Update Form'!$G$198","v":80},{"$f":"'Data Update Form'!$G$200","v":0},{"$f":"'Data Update Form'!$G$200","v":0},{"$f":"'Data Update Form'!$G$202","v":45},{"$f":"'Data Update Form'!$G$202","v":45},{"$f":"'Data Update Form'!$G$202","v":45},{"$f":"'Data Update Form'!$G$202","v":45},{"$f":"'Data Update Form'!$G$202","v":45},{"$f":"'Data Update Form'!$G$204","v":120},{"$f":"'Data Update Form'!$G$204","v":120},{"$f":"'Data Update Form'!$G$204","v":120},{"$f":"'Data Update Form'!$G$204","v":120},{"$f":"'Data Update Form'!$G$204","v":120},{"$f":"'Data Update Form'!$G$204","v":120},{"$f":"'Data Update Form'!$G$204","v":120},{"$f":"'Data Update Form'!$G$204","v":120},{"$f":"'Data Update Form'!$G$204","v":120},{"$f":"'Data Update Form'!$G$204","v":120},{"$f":"'Data Update Form'!$G$204","v":120},{"$f":"'Data Update Form'!$G$204","v":120},{"$f":"'Data Update Form'!$G$204","v":120},{"$f":"'Data Update Form'!$G$204","v":120}]
[79]
[80,"Sweet Corn",0,null,{"$f":"'Data Update Form'!$C$383","v":10},{"$f":"'Data Update Form'!$C$385","v":70},null,{"$f":"'Data Update Form'!$C$387","v":80},{"$f":"'Data Update Form'!$C$389","v":80},{"$f":"'Data Update Form'!$C$389","v":80},{"$f":"'Data Update Form'!$C$391","v":70},{"$f":"'Data Update Form'!$C$391","v":70},{"$f":"'Data Update Form'!$C$391","v":70},{"$f":"'Data Update Form'!$C$391","v":70},{"$f":"'Data Update Form'!$C$391","v":70},{"$f":"'Data Update Form'!$C$393","v":110},{"$f":"'Data Update Form'!$C$393","v":110},{"$f":"'Data Update Form'!$C$393","v":110},{"$f":"'Data Update Form'!$C$393","v":110},{"$f":"'Data Update Form'!$C$393","v":110},{"$f":"'Data Update Form'!$C$393","v":110},{"$f":"'Data Update Form'!$C$393","v":110},{"$f":"'Data Update Form'!$C$393","v":110},{"$f":"'Data Update Form'!$C$393","v":110},{"$f":"'Data Update Form'!$C$393","v":110},{"$f":"'Data Update Form'!$C$393","v":110},{"$f":"'Data Update Form'!$C$393","v":110},{"$f":"'Data Update Form'!$C$393","v":110},{"$f":"'Data Update Form'!$C$393","v":110},"Sweet Corn",0,null,{"$f":"'Data Update Form'!$C$384","v":0},{"$f":"'Data Update Form'!$C$386","v":40},null,{"$f":"'Data Update Form'!$C$388","v":50},{"$f":"'Data Update Form'!$C$390","v":50},{"$f":"'Data Update Form'!$C$390","v":50},{"$f":"'Data Update Form'!$C$392","v":40},{"$f":"'Data Update Form'!$C$392","v":40},{"$f":"'Data Update Form'!$C$392","v":40},{"$f":"'Data Update Form'!$C$392","v":40},{"$f":"'Data Update Form'!$C$392","v":40},{"$f":"'Data Update Form'!$C$394","v":80},{"$f":"'Data Update Form'!$C$394","v":80},{"$f":"'Data Update Form'!$C$394","v":80},{"$f":"'Data Update Form'!$C$394","v":80},{"$f":"'Data Update Form'!$C$394","v":80},{"$f":"'Data Update Form'!$C$394","v":80},{"$f":"'Data Update Form'!$C$394","v":80},{"$f":"'Data Update Form'!$C$394","v":80},{"$f":"'Data Update Form'!$C$394","v":80},{"$f":"'Data Update Form'!$C$394","v":80},{"$f":"'Data Update Form'!$C$394","v":80},{"$f":"'Data Update Form'!$C$394","v":80},{"$f":"'Data Update Form'!$C$394","v":80},{"$f":"'Data Update Form'!$C$394","v":80}]
[81,"Sweet Corn",6,null,{"$f":"'Data Update Form'!$D$383","v":30},{"$f":"'Data Update Form'!$D$385","v":90},null,{"$f":"'Data Update Form'!$D$387","v":100},{"$f":"'Data Update Form'!$D$389","v":100},{"$f":"'Data Update Form'!$D$389","v":100},{"$f":"'Data Update Form'!$D$391","v":90},{"$f":"'Data Update Form'!$D$391","v":90},{"$f":"'Data Update Form'!$D$391","v":90},{"$f":"'Data Update Form'!$D$391","v":90},{"$f":"'Data Update Form'!$D$391","v":90},{"$f":"'Data Update Form'!$D$393","v":130},{"$f":"'Data Update Form'!$D$393","v":130},{"$f":"'Data Update Form'!$D$393","v":130},{"$f":"'Data Update Form'!$D$393","v":130},{"$f":"'Data Update Form'!$D$393","v":130},{"$f":"'Data Update Form'!$D$393","v":130},{"$f":"'Data Update Form'!$D$393","v":130},{"$f":"'Data Update Form'!$D$393","v":130},{"$f":"'Data Update Form'!$D$393","v":130},{"$f":"'Data Update Form'!$D$393","v":130},{"$f":"'Data Update Form'!$D$393","v":130},{"$f":"'Data Update Form'!$D$393","v":130},{"$f":"'Data Update Form'!$D$393","v":130},{"$f":"'Data Update Form'!$D$393","v":130},"Sweet Corn",6,null,{"$f":"'Data Update Form'!$D$384","v":0},{"$f":"'Data Update Form'!$D$386","v":60},null,{"$f":"'Data Update Form'!$D$388","v":70},{"$f":"'Data Update Form'!$D$390","v":70},{"$f":"'Data Update Form'!$D$390","v":70},{"$f":"'Data Update Form'!$D$392","v":60},{"$f":"'Data Update Form'!$D$392","v":60},{"$f":"'Data Update Form'!$D$392","v":60},{"$f":"'Data Update Form'!$D$392","v":60},{"$f":"'Data Update Form'!$D$392","v":60},{"$f":"'Data Update Form'!$D$394","v":100},{"$f":"'Data Update Form'!$D$394","v":100},{"$f":"'Data Update Form'!$D$394","v":100},{"$f":"'Data Update Form'!$D$394","v":100},{"$f":"'Data Update Form'!$D$394","v":100},{"$f":"'Data Update Form'!$D$394","v":100},{"$f":"'Data Update Form'!$D$394","v":100},{"$f":"'Data Update Form'!$D$394","v":100},{"$f":"'Data Update Form'!$D$394","v":100},{"$f":"'Data Update Form'!$D$394","v":100},{"$f":"'Data Update Form'!$D$394","v":100},{"$f":"'Data Update Form'!$D$394","v":100},{"$f":"'Data Update Form'!$D$394","v":100},{"$f":"'Data Update Form'!$D$394","v":100}]
[82,"Sweet Corn",8,null,{"$f":"'Data Update Form'!$E$383","v":50},{"$f":"'Data Update Form'!$E$385","v":110},null,{"$f":"'Data Update Form'!$E$387","v":120},{"$f":"'Data Update Form'!$E$389","v":120},{"$f":"'Data Update Form'!$E$389","v":120},{"$f":"'Data Update Form'!$E$391","v":110},{"$f":"'Data Update Form'!$E$391","v":110},{"$f":"'Data Update Form'!$E$391","v":110},{"$f":"'Data Update Form'!$E$391","v":110},{"$f":"'Data Update Form'!$E$391","v":110},{"$f":"'Data Update Form'!$E$393","v":150},{"$f":"'Data Update Form'!$E$393","v":150},{"$f":"'Data Update Form'!$E$393","v":150},{"$f":"'Data Update Form'!$E$393","v":150},{"$f":"'Data Update Form'!$E$393","v":150},{"$f":"'Data Update Form'!$E$393","v":150},{"$f":"'Data Update Form'!$E$393","v":150},{"$f":"'Data Update Form'!$E$393","v":150},{"$f":"'Data Update Form'!$E$393","v":150},{"$f":"'Data Update Form'!$E$393","v":150},{"$f":"'Data Update Form'!$E$393","v":150},{"$f":"'Data Update Form'!$E$393","v":150},{"$f":"'Data Update Form'!$E$393","v":150},{"$f":"'Data Update Form'!$E$393","v":150},"Sweet Corn",8,null,{"$f":"'Data Update Form'!$E$384","v":20},{"$f":"'Data Update Form'!$E$386","v":80},null,{"$f":"'Data Update Form'!$E$388","v":90},{"$f":"'Data Update Form'!$E$390","v":90},{"$f":"'Data Update Form'!$E$390","v":90},{"$f":"'Data Update Form'!$E$392","v":80},{"$f":"'Data Update Form'!$E$392","v":80},{"$f":"'Data Update Form'!$E$392","v":80},{"$f":"'Data Update Form'!$E$392","v":80},{"$f":"'Data Update Form'!$E$392","v":80},{"$f":"'Data Update Form'!$E$394","v":120},{"$f":"'Data Update Form'!$E$394","v":120},{"$f":"'Data Update Form'!$E$394","v":120},{"$f":"'Data Update Form'!$E$394","v":120},{"$f":"'Data Update Form'!$E$394","v":120},{"$f":"'Data Update Form'!$E$394","v":120},{"$f":"'Data Update Form'!$E$394","v":120},{"$f":"'Data Update Form'!$E$394","v":120},{"$f":"'Data Update Form'!$E$394","v":120},{"$f":"'Data Update Form'!$E$394","v":120},{"$f":"'Data Update Form'!$E$394","v":120},{"$f":"'Data Update Form'!$E$394","v":120},{"$f":"'Data Update Form'!$E$394","v":120},{"$f":"'Data Update Form'!$E$394","v":120}]
[83,"Sweet Corn",10,null,{"$f":"'Data Update Form'!$F$383","v":70},{"$f":"'Data Update Form'!$F$385","v":130},null,{"$f":"'Data Update Form'!$F$387","v":140},{"$f":"'Data Update Form'!$F$389","v":140},{"$f":"'Data Update Form'!$F$389","v":140},{"$f":"'Data Update Form'!$F$391","v":130},{"$f":"'Data Update Form'!$F$391","v":130},{"$f":"'Data Update Form'!$F$391","v":130},{"$f":"'Data Update Form'!$F$391","v":130},{"$f":"'Data Update Form'!$F$391","v":130},{"$f":"'Data Update Form'!$F$393","v":170},{"$f":"'Data Update Form'!$F$393","v":170},{"$f":"'Data Update Form'!$F$393","v":170},{"$f":"'Data Update Form'!$F$393","v":170},{"$f":"'Data Update Form'!$F$393","v":170},{"$f":"'Data Update Form'!$F$393","v":170},{"$f":"'Data Update Form'!$F$393","v":170},{"$f":"'Data Update Form'!$F$393","v":170},{"$f":"'Data Update Form'!$F$393","v":170},{"$f":"'Data Update Form'!$F$393","v":170},{"$f":"'Data Update Form'!$F$393","v":170},{"$f":"'Data Update Form'!$F$393","v":170},{"$f":"'Data Update Form'!$F$393","v":170},{"$f":"'Data Update Form'!$F$393","v":170},"Sweet Corn",10,null,{"$f":"'Data Update Form'!$F$384","v":40},{"$f":"'Data Update Form'!$F$386","v":100},null,{"$f":"'Data Update Form'!$F$388","v":110},{"$f":"'Data Update Form'!$F$390","v":110},{"$f":"'Data Update Form'!$F$390","v":110},{"$f":"'Data Update Form'!$F$392","v":100},{"$f":"'Data Update Form'!$F$392","v":100},{"$f":"'Data Update Form'!$F$392","v":100},{"$f":"'Data Update Form'!$F$392","v":100},{"$f":"'Data Update Form'!$F$392","v":100},{"$f":"'Data Update Form'!$F$394","v":140},{"$f":"'Data Update Form'!$F$394","v":140},{"$f":"'Data Update Form'!$F$394","v":140},{"$f":"'Data Update Form'!$F$394","v":140},{"$f":"'Data Update Form'!$F$394","v":140},{"$f":"'Data Update Form'!$F$394","v":140},{"$f":"'Data Update Form'!$F$394","v":140},{"$f":"'Data Update Form'!$F$394","v":140},{"$f":"'Data Update Form'!$F$394","v":140},{"$f":"'Data Update Form'!$F$394","v":140},{"$f":"'Data Update Form'!$F$394","v":140},{"$f":"'Data Update Form'!$F$394","v":140},{"$f":"'Data Update Form'!$F$394","v":140},{"$f":"'Data Update Form'!$F$394","v":140}]
[84]
[85,"Peas",0,null,{"$f":"'Data Update Form'!$C$403","v":0},{"$f":"'Data Update Form'!$C$405","v":0},null,{"$f":"'Data Update Form'!$C$407","v":0},{"$f":"'Data Update Form'!$C$409","v":0},{"$f":"'Data Update Form'!$C$409","v":0},{"$f":"'Data Update Form'!$C$411","v":0},{"$f":"'Data Update Form'!$C$411","v":0},{"$f":"'Data Update Form'!$C$411","v":0},{"$f":"'Data Update Form'!$C$411","v":0},{"$f":"'Data Update Form'!$C$411","v":0},{"$f":"'Data Update Form'!$C$413","v":0},{"$f":"'Data Update Form'!$C$413","v":0},{"$f":"'Data Update Form'!$C$413","v":0},{"$f":"'Data Update Form'!$C$413","v":0},{"$f":"'Data Update Form'!$C$413","v":0},{"$f":"'Data Update Form'!$C$413","v":0},{"$f":"'Data Update Form'!$C$413","v":0},{"$f":"'Data Update Form'!$C$413","v":0},{"$f":"'Data Update Form'!$C$413","v":0},{"$f":"'Data Update Form'!$C$413","v":0},{"$f":"'Data Update Form'!$C$413","v":0},{"$f":"'Data Update Form'!$C$413","v":0},{"$f":"'Data Update Form'!$C$413","v":0},{"$f":"'Data Update Form'!$C$413","v":0},"Peas",0,null,{"$f":"'Data Update Form'!$C$404","v":0},{"$f":"'Data Update Form'!$C$406","v":0},null,{"$f":"'Data Update Form'!$C$408","v":0},{"$f":"'Data Update Form'!$C$410","v":0},{"$f":"'Data Update Form'!$C$410","v":0},{"$f":"'Data Update Form'!$C$412","v":0},{"$f":"'Data Update Form'!$C$412","v":0},{"$f":"'Data Update Form'!$C$412","v":0},{"$f":"'Data Update Form'!$C$412","v":0},{"$f":"'Data Update Form'!$C$412","v":0},{"$f":"'Data Update Form'!$C$414","v":0},{"$f":"'Data Update Form'!$C$414","v":0},{"$f":"'Data Update Form'!$C$414","v":0},{"$f":"'Data Update Form'!$C$414","v":0},{"$f":"'Data Update Form'!$C$414","v":0},{"$f":"'Data Update Form'!$C$414","v":0},{"$f":"'Data Update Form'!$C$414","v":0},{"$f":"'Data Update Form'!$C$414","v":0},{"$f":"'Data Update Form'!$C$414","v":0},{"$f":"'Data Update Form'!$C$414","v":0},{"$f":"'Data Update Form'!$C$414","v":0},{"$f":"'Data Update Form'!$C$414","v":0},{"$f":"'Data Update Form'!$C$414","v":0},{"$f":"'Data Update Form'!$C$414","v":0}]
[86,"Peas",1000,null,{"$f":"'Data Update Form'!$D$403","v":0},{"$f":"'Data Update Form'!$D$405","v":0},null,{"$f":"'Data Update Form'!$D$407","v":0},{"$f":"'Data Update Form'!$D$409","v":0},{"$f":"'Data Update Form'!$D$409","v":0},{"$f":"'Data Update Form'!$D$411","v":0},{"$f":"'Data Update Form'!$D$411","v":0},{"$f":"'Data Update Form'!$D$411","v":0},{"$f":"'Data Update Form'!$D$411","v":0},{"$f":"'Data Update Form'!$D$411","v":0},{"$f":"'Data Update Form'!$D$413","v":10},{"$f":"'Data Update Form'!$D$413","v":10},{"$f":"'Data Update Form'!$D$413","v":10},{"$f":"'Data Update Form'!$D$413","v":10},{"$f":"'Data Update Form'!$D$413","v":10},{"$f":"'Data Update Form'!$D$413","v":10},{"$f":"'Data Update Form'!$D$413","v":10},{"$f":"'Data Update Form'!$D$413","v":10},{"$f":"'Data Update Form'!$D$413","v":10},{"$f":"'Data Update Form'!$D$413","v":10},{"$f":"'Data Update Form'!$D$413","v":10},{"$f":"'Data Update Form'!$D$413","v":10},{"$f":"'Data Update Form'!$D$413","v":10},{"$f":"'Data Update Form'!$D$413","v":10},"Peas",1000,null,{"$f":"'Data Update Form'!$D$404","v":0},{"$f":"'Data Update Form'!$D$406","v":0},null,{"$f":"'Data Update Form'!$D$408","v":0},{"$f":"'Data Update Form'!$D$410","v":0},{"$f":"'Data Update Form'!$D$410","v":0},{"$f":"'Data Update Form'!$D$412","v":0},{"$f":"'Data Update Form'!$D$412","v":0},{"$f":"'Data Update Form'!$D$412","v":0},{"$f":"'Data Update Form'!$D$412","v":0},{"$f":"'Data Update Form'!$D$412","v":0},{"$f":"'Data Update Form'!$D$414","v":0},{"$f":"'Data Update Form'!$D$414","v":0},{"$f":"'Data Update Form'!$D$414","v":0},{"$f":"'Data Update Form'!$D$414","v":0},{"$f":"'Data Update Form'!$D$414","v":0},{"$f":"'Data Update Form'!$D$414","v":0},{"$f":"'Data Update Form'!$D$414","v":0},{"$f":"'Data Update Form'!$D$414","v":0},{"$f":"'Data Update Form'!$D$414","v":0},{"$f":"'Data Update Form'!$D$414","v":0},{"$f":"'Data Update Form'!$D$414","v":0},{"$f":"'Data Update Form'!$D$414","v":0},{"$f":"'Data Update Form'!$D$414","v":0},{"$f":"'Data Update Form'!$D$414","v":0}]
[87,"Peas",2000,null,{"$f":"'Data Update Form'!$E$403","v":0},{"$f":"'Data Update Form'!$E$405","v":0},null,{"$f":"'Data Update Form'!$E$407","v":10},{"$f":"'Data Update Form'!$E$409","v":10},{"$f":"'Data Update Form'!$E$409","v":10},{"$f":"'Data Update Form'!$E$411","v":0},{"$f":"'Data Update Form'!$E$411","v":0},{"$f":"'Data Update Form'!$E$411","v":0},{"$f":"'Data Update Form'!$E$411","v":0},{"$f":"'Data Update Form'!$E$411","v":0},{"$f":"'Data Update Form'!$E$413","v":20},{"$f":"'Data Update Form'!$E$413","v":20},{"$f":"'Data Update Form'!$E$413","v":20},{"$f":"'Data Update Form'!$E$413","v":20},{"$f":"'Data Update Form'!$E$413","v":20},{"$f":"'Data Update Form'!$E$413","v":20},{"$f":"'Data Update Form'!$E$413","v":20},{"$f":"'Data Update Form'!$E$413","v":20},{"$f":"'Data Update Form'!$E$413","v":20},{"$f":"'Data Update Form'!$E$413","v":20},{"$f":"'Data Update Form'!$E$413","v":20},{"$f":"'Data Update Form'!$E$413","v":20},{"$f":"'Data Update Form'!$E$413","v":20},{"$f":"'Data Update Form'!$E$413","v":20},"Peas",2000,null,{"$f":"'Data Update Form'!$E$404","v":0},{"$f":"'Data Update Form'!$E$406","v":0},null,{"$f":"'Data Update Form'!$E$408","v":0},{"$f":"'Data Update Form'!$E$410","v":0},{"$f":"'Data Update Form'!$E$410","v":0},{"$f":"'Data Update Form'!$E$412","v":0},{"$f":"'Data Update Form'!$E$412","v":0},{"$f":"'Data Update Form'!$E$412","v":0},{"$f":"'Data Update Form'!$E$412","v":0},{"$f":"'Data Update Form'!$E$412","v":0},{"$f":"'Data Update Form'!$E$414","v":10},{"$f":"'Data Update Form'!$E$414","v":10},{"$f":"'Data Update Form'!$E$414","v":10},{"$f":"'Data Update Form'!$E$414","v":10},{"$f":"'Data Update Form'!$E$414","v":10},{"$f":"'Data Update Form'!$E$414","v":10},{"$f":"'Data Update Form'!$E$414","v":10},{"$f":"'Data Update Form'!$E$414","v":10},{"$f":"'Data Update Form'!$E$414","v":10},{"$f":"'Data Update Form'!$E$414","v":10},{"$f":"'Data Update Form'!$E$414","v":10},{"$f":"'Data Update Form'!$E$414","v":10},{"$f":"'Data Update Form'!$E$414","v":10},{"$f":"'Data Update Form'!$E$414","v":10}]
[88,"Peas",4000,null,{"$f":"'Data Update Form'!$F$403","v":0},{"$f":"'Data Update Form'!$F$405","v":10},null,{"$f":"'Data Update Form'!$F$407","v":20},{"$f":"'Data Update Form'!$F$409","v":20},{"$f":"'Data Update Form'!$F$409","v":20},{"$f":"'Data Update Form'!$F$411","v":10},{"$f":"'Data Update Form'!$F$411","v":10},{"$f":"'Data Update Form'!$F$411","v":10},{"$f":"'Data Update Form'!$F$411","v":10},{"$f":"'Data Update Form'!$F$411","v":10},{"$f":"'Data Update Form'!$F$413","v":40},{"$f":"'Data Update Form'!$F$413","v":40},{"$f":"'Data Update Form'!$F$413","v":40},{"$f":"'Data Update Form'!$F$413","v":40},{"$f":"'Data Update Form'!$F$413","v":40},{"$f":"'Data Update Form'!$F$413","v":40},{"$f":"'Data Update Form'!$F$413","v":40},{"$f":"'Data Update Form'!$F$413","v":40},{"$f":"'Data Update Form'!$F$413","v":40},{"$f":"'Data Update Form'!$F$413","v":40},{"$f":"'Data Update Form'!$F$413","v":40},{"$f":"'Data Update Form'!$F$413","v":40},{"$f":"'Data Update Form'!$F$413","v":40},{"$f":"'Data Update Form'!$F$413","v":40},"Peas",4000,null,{"$f":"'Data Update Form'!$F$404","v":0},{"$f":"'Data Update Form'!$F$406","v":0},null,{"$f":"'Data Update Form'!$F$408","v":0},{"$f":"'Data Update Form'!$F$410","v":0},{"$f":"'Data Update Form'!$F$410","v":0},{"$f":"'Data Update Form'!$F$412","v":0},{"$f":"'Data Update Form'!$F$412","v":0},{"$f":"'Data Update Form'!$F$412","v":0},{"$f":"'Data Update Form'!$F$412","v":0},{"$f":"'Data Update Form'!$F$412","v":0},{"$f":"'Data Update Form'!$F$414","v":20},{"$f":"'Data Update Form'!$F$414","v":20},{"$f":"'Data Update Form'!$F$414","v":20},{"$f":"'Data Update Form'!$F$414","v":20},{"$f":"'Data Update Form'!$F$414","v":20},{"$f":"'Data Update Form'!$F$414","v":20},{"$f":"'Data Update Form'!$F$414","v":20},{"$f":"'Data Update Form'!$F$414","v":20},{"$f":"'Data Update Form'!$F$414","v":20},{"$f":"'Data Update Form'!$F$414","v":20},{"$f":"'Data Update Form'!$F$414","v":20},{"$f":"'Data Update Form'!$F$414","v":20},{"$f":"'Data Update Form'!$F$414","v":20},{"$f":"'Data Update Form'!$F$414","v":20}]
[89]
[90,"Sorghum",0,null,{"$f":"'Data Update Form'!$C$459","v":0},{"$f":"'Data Update Form'!$C$461","v":0},null,{"$f":"'Data Update Form'!$C$463","v":35},{"$f":"'Data Update Form'!$C$465","v":35},{"$f":"'Data Update Form'!$C$465","v":35},{"$f":"'Data Update Form'!$C$467","v":35},{"$f":"'Data Update Form'!$C$467","v":35},{"$f":"'Data Update Form'!$C$467","v":35},{"$f":"'Data Update Form'!$C$467","v":35},{"$f":"'Data Update Form'!$C$467","v":35},{"$f":"'Data Update Form'!$C$469","v":75},{"$f":"'Data Update Form'!$C$469","v":75},{"$f":"'Data Update Form'!$C$469","v":75},{"$f":"'Data Update Form'!$C$469","v":75},{"$f":"'Data Update Form'!$C$469","v":75},{"$f":"'Data Update Form'!$C$469","v":75},{"$f":"'Data Update Form'!$C$469","v":75},{"$f":"'Data Update Form'!$C$469","v":75},{"$f":"'Data Update Form'!$C$469","v":75},{"$f":"'Data Update Form'!$C$469","v":75},{"$f":"'Data Update Form'!$C$469","v":75},{"$f":"'Data Update Form'!$C$469","v":75},{"$f":"'Data Update Form'!$C$469","v":75},{"$f":"'Data Update Form'!$C$469","v":75},"Sorghum",0,null,{"$f":"'Data Update Form'!$C$460","v":0},{"$f":"'Data Update Form'!$C$462","v":0},null,{"$f":"'Data Update Form'!$C$464","v":35},{"$f":"'Data Update Form'!$C$466","v":35},{"$f":"'Data Update Form'!$C$466","v":35},{"$f":"'Data Update Form'!$C$468","v":35},{"$f":"'Data Update Form'!$C$468","v":35},{"$f":"'Data Update Form'!$C$468","v":35},{"$f":"'Data Update Form'!$C$468","v":35},{"$f":"'Data Update Form'!$C$468","v":35},{"$f":"'Data Update Form'!$C$470","v":75},{"$f":"'Data Update Form'!$C$470","v":75},{"$f":"'Data Update Form'!$C$470","v":75},{"$f":"'Data Update Form'!$C$470","v":75},{"$f":"'Data Update Form'!$C$470","v":75},{"$f":"'Data Update Form'!$C$470","v":75},{"$f":"'Data Update Form'!$C$470","v":75},{"$f":"'Data Update Form'!$C$470","v":75},{"$f":"'Data Update Form'!$C$470","v":75},{"$f":"'Data Update Form'!$C$470","v":75},{"$f":"'Data Update Form'!$C$470","v":75},{"$f":"'Data Update Form'!$C$470","v":75},{"$f":"'Data Update Form'!$C$470","v":75},{"$f":"'Data Update Form'!$C$470","v":75}]
[91,"Sorghum",5,null,{"$f":"'Data Update Form'!$D$459","v":0},{"$f":"'Data Update Form'!$D$461","v":25},null,{"$f":"'Data Update Form'!$D$463","v":85},{"$f":"'Data Update Form'!$D$465","v":85},{"$f":"'Data Update Form'!$D$465","v":85},{"$f":"'Data Update Form'!$D$467","v":85},{"$f":"'Data Update Form'!$D$467","v":85},{"$f":"'Data Update Form'!$D$467","v":85},{"$f":"'Data Update Form'!$D$467","v":85},{"$f":"'Data Update Form'!$D$467","v":85},{"$f":"'Data Update Form'!$D$469","v":125},{"$f":"'Data Update Form'!$D$469","v":125},{"$f":"'Data Update Form'!$D$469","v":125},{"$f":"'Data Update Form'!$D$469","v":125},{"$f":"'Data Update Form'!$D$469","v":125},{"$f":"'Data Update Form'!$D$469","v":125},{"$f":"'Data Update Form'!$D$469","v":125},{"$f":"'Data Update Form'!$D$469","v":125},{"$f":"'Data Update Form'!$D$469","v":125},{"$f":"'Data Update Form'!$D$469","v":125},{"$f":"'Data Update Form'!$D$469","v":125},{"$f":"'Data Update Form'!$D$469","v":125},{"$f":"'Data Update Form'!$D$469","v":125},{"$f":"'Data Update Form'!$D$469","v":125},"Sorghum",5,null,{"$f":"'Data Update Form'!$D$460","v":0},{"$f":"'Data Update Form'!$D$462","v":25},null,{"$f":"'Data Update Form'!$D$464","v":85},{"$f":"'Data Update Form'!$D$466","v":85},{"$f":"'Data Update Form'!$D$466","v":85},{"$f":"'Data Update Form'!$D$468","v":85},{"$f":"'Data Update Form'!$D$468","v":85},{"$f":"'Data Update Form'!$D$468","v":85},{"$f":"'Data Update Form'!$D$468","v":85},{"$f":"'Data Update Form'!$D$468","v":85},{"$f":"'Data Update Form'!$D$470","v":125},{"$f":"'Data Update Form'!$D$470","v":125},{"$f":"'Data Update Form'!$D$470","v":125},{"$f":"'Data Update Form'!$D$470","v":125},{"$f":"'Data Update Form'!$D$470","v":125},{"$f":"'Data Update Form'!$D$470","v":125},{"$f":"'Data Update Form'!$D$470","v":125},{"$f":"'Data Update Form'!$D$470","v":125},{"$f":"'Data Update Form'!$D$470","v":125},{"$f":"'Data Update Form'!$D$470","v":125},{"$f":"'Data Update Form'!$D$470","v":125},{"$f":"'Data Update Form'!$D$470","v":125},{"$f":"'Data Update Form'!$D$470","v":125},{"$f":"'Data Update Form'!$D$470","v":125}]
[92,"Sorghum",7,null,{"$f":"'Data Update Form'!$E$459","v":25},{"$f":"'Data Update Form'!$E$461","v":75},null,{"$f":"'Data Update Form'!$E$463","v":135},{"$f":"'Data Update Form'!$E$465","v":135},{"$f":"'Data Update Form'!$E$465","v":135},{"$f":"'Data Update Form'!$E$467","v":135},{"$f":"'Data Update Form'!$E$467","v":135},{"$f":"'Data Update Form'!$E$467","v":135},{"$f":"'Data Update Form'!$E$467","v":135},{"$f":"'Data Update Form'!$E$467","v":135},{"$f":"'Data Update Form'!$E$469","v":175},{"$f":"'Data Update Form'!$E$469","v":175},{"$f":"'Data Update Form'!$E$469","v":175},{"$f":"'Data Update Form'!$E$469","v":175},{"$f":"'Data Update Form'!$E$469","v":175},{"$f":"'Data Update Form'!$E$469","v":175},{"$f":"'Data Update Form'!$E$469","v":175},{"$f":"'Data Update Form'!$E$469","v":175},{"$f":"'Data Update Form'!$E$469","v":175},{"$f":"'Data Update Form'!$E$469","v":175},{"$f":"'Data Update Form'!$E$469","v":175},{"$f":"'Data Update Form'!$E$469","v":175},{"$f":"'Data Update Form'!$E$469","v":175},{"$f":"'Data Update Form'!$E$469","v":175},"Sorghum",7,null,{"$f":"'Data Update Form'!$E$460","v":25},{"$f":"'Data Update Form'!$E$462","v":75},null,{"$f":"'Data Update Form'!$E$464","v":135},{"$f":"'Data Update Form'!$E$466","v":135},{"$f":"'Data Update Form'!$E$466","v":135},{"$f":"'Data Update Form'!$E$468","v":135},{"$f":"'Data Update Form'!$E$468","v":135},{"$f":"'Data Update Form'!$E$468","v":135},{"$f":"'Data Update Form'!$E$468","v":135},{"$f":"'Data Update Form'!$E$468","v":135},{"$f":"'Data Update Form'!$E$470","v":175},{"$f":"'Data Update Form'!$E$470","v":175},{"$f":"'Data Update Form'!$E$470","v":175},{"$f":"'Data Update Form'!$E$470","v":175},{"$f":"'Data Update Form'!$E$470","v":175},{"$f":"'Data Update Form'!$E$470","v":175},{"$f":"'Data Update Form'!$E$470","v":175},{"$f":"'Data Update Form'!$E$470","v":175},{"$f":"'Data Update Form'!$E$470","v":175},{"$f":"'Data Update Form'!$E$470","v":175},{"$f":"'Data Update Form'!$E$470","v":175},{"$f":"'Data Update Form'!$E$470","v":175},{"$f":"'Data Update Form'!$E$470","v":175},{"$f":"'Data Update Form'!$E$470","v":175}]
[93,"Sorghum",9,null,{"$f":"'Data Update Form'!$F$459","v":75},{"$f":"'Data Update Form'!$F$461","v":125},null,{"$f":"'Data Update Form'!$F$463","v":185},{"$f":"'Data Update Form'!$F$465","v":185},{"$f":"'Data Update Form'!$F$465","v":185},{"$f":"'Data Update Form'!$F$467","v":185},{"$f":"'Data Update Form'!$F$467","v":185},{"$f":"'Data Update Form'!$F$467","v":185},{"$f":"'Data Update Form'!$F$467","v":185},{"$f":"'Data Update Form'!$F$467","v":185},{"$f":"'Data Update Form'!$F$469","v":225},{"$f":"'Data Update Form'!$F$469","v":225},{"$f":"'Data Update Form'!$F$469","v":225},{"$f":"'Data Update Form'!$F$469","v":225},{"$f":"'Data Update Form'!$F$469","v":225},{"$f":"'Data Update Form'!$F$469","v":225},{"$f":"'Data Update Form'!$F$469","v":225},{"$f":"'Data Update Form'!$F$469","v":225},{"$f":"'Data Update Form'!$F$469","v":225},{"$f":"'Data Update Form'!$F$469","v":225},{"$f":"'Data Update Form'!$F$469","v":225},{"$f":"'Data Update Form'!$F$469","v":225},{"$f":"'Data Update Form'!$F$469","v":225},{"$f":"'Data Update Form'!$F$469","v":225},"Sorghum",9,null,{"$f":"'Data Update Form'!$F$460","v":75},{"$f":"'Data Update Form'!$F$462","v":125},null,{"$f":"'Data Update Form'!$F$464","v":185},{"$f":"'Data Update Form'!$F$466","v":185},{"$f":"'Data Update Form'!$F$466","v":185},{"$f":"'Data Update Form'!$F$468","v":185},{"$f":"'Data Update Form'!$F$468","v":185},{"$f":"'Data Update Form'!$F$468","v":185},{"$f":"'Data Update Form'!$F$468","v":185},{"$f":"'Data Update Form'!$F$468","v":185},{"$f":"'Data Update Form'!$F$470","v":225},{"$f":"'Data Update Form'!$F$470","v":225},{"$f":"'Data Update Form'!$F$470","v":225},{"$f":"'Data Update Form'!$F$470","v":225},{"$f":"'Data Update Form'!$F$470","v":225},{"$f":"'Data Update Form'!$F$470","v":225},{"$f":"'Data Update Form'!$F$470","v":225},{"$f":"'Data Update Form'!$F$470","v":225},{"$f":"'Data Update Form'!$F$470","v":225},{"$f":"'Data Update Form'!$F$470","v":225},{"$f":"'Data Update Form'!$F$470","v":225},{"$f":"'Data Update Form'!$F$470","v":225},{"$f":"'Data Update Form'!$F$470","v":225},{"$f":"'Data Update Form'!$F$470","v":225}]
[94]
[95,"Potatoes",0,null,{"$f":"'Data Update Form'!$C$423","v":0},{"$f":"'Data Update Form'!$C$425","v":35},null,{"$f":"'Data Update Form'!$C$427","v":55},{"$f":"'Data Update Form'!$C$429","v":55},{"$f":"'Data Update Form'!$C$429","v":55},{"$f":"'Data Update Form'!$C$431","v":35},{"$f":"'Data Update Form'!$C$431","v":35},{"$f":"'Data Update Form'!$C$431","v":35},{"$f":"'Data Update Form'!$C$431","v":35},{"$f":"'Data Update Form'!$C$431","v":35},{"$f":"'Data Update Form'!$C$433","v":75},{"$f":"'Data Update Form'!$C$433","v":75},{"$f":"'Data Update Form'!$C$433","v":75},{"$f":"'Data Update Form'!$C$433","v":75},{"$f":"'Data Update Form'!$C$433","v":75},{"$f":"'Data Update Form'!$C$433","v":75},{"$f":"'Data Update Form'!$C$433","v":75},{"$f":"'Data Update Form'!$C$433","v":75},{"$f":"'Data Update Form'!$C$433","v":75},{"$f":"'Data Update Form'!$C$433","v":75},{"$f":"'Data Update Form'!$C$433","v":75},{"$f":"'Data Update Form'!$C$433","v":75},{"$f":"'Data Update Form'!$C$433","v":75},{"$f":"'Data Update Form'!$C$433","v":75},"Potatoes",0,null,{"$f":"'Data Update Form'!$C$424","v":0},{"$f":"'Data Update Form'!$C$426","v":15},null,{"$f":"'Data Update Form'!$C$428","v":35},{"$f":"'Data Update Form'!$C$430","v":35},{"$f":"'Data Update Form'!$C$430","v":35},{"$f":"'Data Update Form'!$C$432","v":15},{"$f":"'Data Update Form'!$C$432","v":15},{"$f":"'Data Update Form'!$C$432","v":15},{"$f":"'Data Update Form'!$C$432","v":15},{"$f":"'Data Update Form'!$C$432","v":15},{"$f":"'Data Update Form'!$C$434","v":55},{"$f":"'Data Update Form'!$C$434","v":55},{"$f":"'Data Update Form'!$C$434","v":55},{"$f":"'Data Update Form'!$C$434","v":55},{"$f":"'Data Update Form'!$C$434","v":55},{"$f":"'Data Update Form'!$C$434","v":55},{"$f":"'Data Update Form'!$C$434","v":55},{"$f":"'Data Update Form'!$C$434","v":55},{"$f":"'Data Update Form'!$C$434","v":55},{"$f":"'Data Update Form'!$C$434","v":55},{"$f":"'Data Update Form'!$C$434","v":55},{"$f":"'Data Update Form'!$C$434","v":55},{"$f":"'Data Update Form'!$C$434","v":55},{"$f":"'Data Update Form'!$C$434","v":55}]
[96,"Potatoes",200,null,{"$f":"'Data Update Form'!$D$423","v":0},{"$f":"'Data Update Form'!$D$425","v":60},null,{"$f":"'Data Update Form'!$D$427","v":80},{"$f":"'Data Update Form'!$D$429","v":80},{"$f":"'Data Update Form'!$D$429","v":80},{"$f":"'Data Update Form'!$D$431","v":60},{"$f":"'Data Update Form'!$D$431","v":60},{"$f":"'Data Update Form'!$D$431","v":60},{"$f":"'Data Update Form'!$D$431","v":60},{"$f":"'Data Update Form'!$D$431","v":60},{"$f":"'Data Update Form'!$D$433","v":100},{"$f":"'Data Update Form'!$D$433","v":100},{"$f":"'Data Update Form'!$D$433","v":100},{"$f":"'Data Update Form'!$D$433","v":100},{"$f":"'Data Update Form'!$D$433","v":100},{"$f":"'Data Update Form'!$D$433","v":100},{"$f":"'Data Update Form'!$D$433","v":100},{"$f":"'Data Update Form'!$D$433","v":100},{"$f":"'Data Update Form'!$D$433","v":100},{"$f":"'Data Update Form'!$D$433","v":100},{"$f":"'Data Update Form'!$D$433","v":100},{"$f":"'Data Update Form'!$D$433","v":100},{"$f":"'Data Update Form'!$D$433","v":100},{"$f":"'Data Update Form'!$D$433","v":100},"Potatoes",200,null,{"$f":"'Data Update Form'!$D$424","v":0},{"$f":"'Data Update Form'!$D$426","v":40},null,{"$f":"'Data Update Form'!$D$428","v":60},{"$f":"'Data Update Form'!$D$430","v":60},{"$f":"'Data Update Form'!$D$430","v":60},{"$f":"'Data Update Form'!$D$432","v":40},{"$f":"'Data Update Form'!$D$432","v":40},{"$f":"'Data Update Form'!$D$432","v":40},{"$f":"'Data Update Form'!$D$432","v":40},{"$f":"'Data Update Form'!$D$432","v":40},{"$f":"'Data Update Form'!$D$434","v":80},{"$f":"'Data Update Form'!$D$434","v":80},{"$f":"'Data Update Form'!$D$434","v":80},{"$f":"'Data Update Form'!$D$434","v":80},{"$f":"'Data Update Form'!$D$434","v":80},{"$f":"'Data Update Form'!$D$434","v":80},{"$f":"'Data Update Form'!$D$434","v":80},{"$f":"'Data Update Form'!$D$434","v":80},{"$f":"'Data Update Form'!$D$434","v":80},{"$f":"'Data Update Form'!$D$434","v":80},{"$f":"'Data Update Form'!$D$434","v":80},{"$f":"'Data Update Form'!$D$434","v":80},{"$f":"'Data Update Form'!$D$434","v":80},{"$f":"'Data Update Form'!$D$434","v":80}]
[97,"Potatoes",250,null,{"$f":"'Data Update Form'!$E$423","v":25},{"$f":"'Data Update Form'!$E$425","v":85},null,{"$f":"'Data Update Form'!$E$427","v":105},{"$f":"'Data Update Form'!$E$429","v":105},{"$f":"'Data Update Form'!$E$429","v":105},{"$f":"'Data Update Form'!$E$431","v":85},{"$f":"'Data Update Form'!$E$431","v":85},{"$f":"'Data Update Form'!$E$431","v":85},{"$f":"'Data Update Form'!$E$431","v":85},{"$f":"'Data Update Form'!$E$431","v":85},{"$f":"'Data Update Form'!$E$433","v":125},{"$f":"'Data Update Form'!$E$433","v":125},{"$f":"'Data Update Form'!$E$433","v":125},{"$f":"'Data Update Form'!$E$433","v":125},{"$f":"'Data Update Form'!$E$433","v":125},{"$f":"'Data Update Form'!$E$433","v":125},{"$f":"'Data Update Form'!$E$433","v":125},{"$f":"'Data Update Form'!$E$433","v":125},{"$f":"'Data Update Form'!$E$433","v":125},{"$f":"'Data Update Form'!$E$433","v":125},{"$f":"'Data Update Form'!$E$433","v":125},{"$f":"'Data Update Form'!$E$433","v":125},{"$f":"'Data Update Form'!$E$433","v":125},{"$f":"'Data Update Form'!$E$433","v":125},"Potatoes",250,null,{"$f":"'Data Update Form'!$E$424","v":0},{"$f":"'Data Update Form'!$E$426","v":65},null,{"$f":"'Data Update Form'!$E$428","v":85},{"$f":"'Data Update Form'!$E$430","v":85},{"$f":"'Data Update Form'!$E$430","v":85},{"$f":"'Data Update Form'!$E$432","v":65},{"$f":"'Data Update Form'!$E$432","v":65},{"$f":"'Data Update Form'!$E$432","v":65},{"$f":"'Data Update Form'!$E$432","v":65},{"$f":"'Data Update Form'!$E$432","v":65},{"$f":"'Data Update Form'!$E$434","v":105},{"$f":"'Data Update Form'!$E$434","v":105},{"$f":"'Data Update Form'!$E$434","v":105},{"$f":"'Data Update Form'!$E$434","v":105},{"$f":"'Data Update Form'!$E$434","v":105},{"$f":"'Data Update Form'!$E$434","v":105},{"$f":"'Data Update Form'!$E$434","v":105},{"$f":"'Data Update Form'!$E$434","v":105},{"$f":"'Data Update Form'!$E$434","v":105},{"$f":"'Data Update Form'!$E$434","v":105},{"$f":"'Data Update Form'!$E$434","v":105},{"$f":"'Data Update Form'!$E$434","v":105},{"$f":"'Data Update Form'!$E$434","v":105},{"$f":"'Data Update Form'!$E$434","v":105}]
[98,"Potatoes",300,null,{"$f":"'Data Update Form'!$F$423","v":50},{"$f":"'Data Update Form'!$F$425","v":110},null,{"$f":"'Data Update Form'!$F$427","v":130},{"$f":"'Data Update Form'!$F$429","v":130},{"$f":"'Data Update Form'!$F$429","v":130},{"$f":"'Data Update Form'!$F$431","v":110},{"$f":"'Data Update Form'!$F$431","v":110},{"$f":"'Data Update Form'!$F$431","v":110},{"$f":"'Data Update Form'!$F$431","v":110},{"$f":"'Data Update Form'!$F$431","v":110},{"$f":"'Data Update Form'!$F$433","v":150},{"$f":"'Data Update Form'!$F$433","v":150},{"$f":"'Data Update Form'!$F$433","v":150},{"$f":"'Data Update Form'!$F$433","v":150},{"$f":"'Data Update Form'!$F$433","v":150},{"$f":"'Data Update Form'!$F$433","v":150},{"$f":"'Data Update Form'!$F$433","v":150},{"$f":"'Data Update Form'!$F$433","v":150},{"$f":"'Data Update Form'!$F$433","v":150},{"$f":"'Data Update Form'!$F$433","v":150},{"$f":"'Data Update Form'!$F$433","v":150},{"$f":"'Data Update Form'!$F$433","v":150},{"$f":"'Data Update Form'!$F$433","v":150},{"$f":"'Data Update Form'!$F$433","v":150},"Potatoes",300,null,{"$f":"'Data Update Form'!$F$424","v":30},{"$f":"'Data Update Form'!$F$426","v":90},null,{"$f":"'Data Update Form'!$F$428","v":110},{"$f":"'Data Update Form'!$F$430","v":110},{"$f":"'Data Update Form'!$F$430","v":110},{"$f":"'Data Update Form'!$F$432","v":90},{"$f":"'Data Update Form'!$F$432","v":90},{"$f":"'Data Update Form'!$F$432","v":90},{"$f":"'Data Update Form'!$F$432","v":90},{"$f":"'Data Update Form'!$F$432","v":90},{"$f":"'Data Update Form'!$F$434","v":130},{"$f":"'Data Update Form'!$F$434","v":130},{"$f":"'Data Update Form'!$F$434","v":130},{"$f":"'Data Update Form'!$F$434","v":130},{"$f":"'Data Update Form'!$F$434","v":130},{"$f":"'Data Update Form'!$F$434","v":130},{"$f":"'Data Update Form'!$F$434","v":130},{"$f":"'Data Update Form'!$F$434","v":130},{"$f":"'Data Update Form'!$F$434","v":130},{"$f":"'Data Update Form'!$F$434","v":130},{"$f":"'Data Update Form'!$F$434","v":130},{"$f":"'Data Update Form'!$F$434","v":130},{"$f":"'Data Update Form'!$F$434","v":130},{"$f":"'Data Update Form'!$F$434","v":130}]
[99,"Potatoes",350,null,{"$f":"'Data Update Form'!$G$423","v":75},{"$f":"'Data Update Form'!$G$425","v":135},null,{"$f":"'Data Update Form'!$G$427","v":155},{"$f":"'Data Update Form'!$G$429","v":155},{"$f":"'Data Update Form'!$G$429","v":155},{"$f":"'Data Update Form'!$G$431","v":135},{"$f":"'Data Update Form'!$G$431","v":135},{"$f":"'Data Update Form'!$G$431","v":135},{"$f":"'Data Update Form'!$G$431","v":135},{"$f":"'Data Update Form'!$G$431","v":135},{"$f":"'Data Update Form'!$G$433","v":175},{"$f":"'Data Update Form'!$G$433","v":175},{"$f":"'Data Update Form'!$G$433","v":175},{"$f":"'Data Update Form'!$G$433","v":175},{"$f":"'Data Update Form'!$G$433","v":175},{"$f":"'Data Update Form'!$G$433","v":175},{"$f":"'Data Update Form'!$G$433","v":175},{"$f":"'Data Update Form'!$G$433","v":175},{"$f":"'Data Update Form'!$G$433","v":175},{"$f":"'Data Update Form'!$G$433","v":175},{"$f":"'Data Update Form'!$G$433","v":175},{"$f":"'Data Update Form'!$G$433","v":175},{"$f":"'Data Update Form'!$G$433","v":175},{"$f":"'Data Update Form'!$G$433","v":175},"Potatoes",350,null,{"$f":"'Data Update Form'!$G$424","v":55},{"$f":"'Data Update Form'!$G$426","v":115},null,{"$f":"'Data Update Form'!$G$428","v":135},{"$f":"'Data Update Form'!$G$430","v":135},{"$f":"'Data Update Form'!$G$430","v":135},{"$f":"'Data Update Form'!$G$432","v":115},{"$f":"'Data Update Form'!$G$432","v":115},{"$f":"'Data Update Form'!$G$432","v":115},{"$f":"'Data Update Form'!$G$432","v":115},{"$f":"'Data Update Form'!$G$432","v":115},{"$f":"'Data Update Form'!$G$434","v":155},{"$f":"'Data Update Form'!$G$434","v":155},{"$f":"'Data Update Form'!$G$434","v":155},{"$f":"'Data Update Form'!$G$434","v":155},{"$f":"'Data Update Form'!$G$434","v":155},{"$f":"'Data Update Form'!$G$434","v":155},{"$f":"'Data Update Form'!$G$434","v":155},{"$f":"'Data Update Form'!$G$434","v":155},{"$f":"'Data Update Form'!$G$434","v":155},{"$f":"'Data Update Form'!$G$434","v":155},{"$f":"'Data Update Form'!$G$434","v":155},{"$f":"'Data Update Form'!$G$434","v":155},{"$f":"'Data Update Form'!$G$434","v":155},{"$f":"'Data Update Form'!$G$434","v":155}]
[100,"Potatoes",400,null,{"$f":"'Data Update Form'!$H$423","v":100},{"$f":"'Data Update Form'!$H$425","v":160},null,{"$f":"'Data Update Form'!$H$427","v":180},{"$f":"'Data Update Form'!$H$429","v":180},{"$f":"'Data Update Form'!$H$429","v":180},{"$f":"'Data Update Form'!$H$431","v":160},{"$f":"'Data Update Form'!$H$431","v":160},{"$f":"'Data Update Form'!$H$431","v":160},{"$f":"'Data Update Form'!$H$431","v":160},{"$f":"'Data Update Form'!$H$431","v":160},{"$f":"'Data Update Form'!$H$433","v":200},{"$f":"'Data Update Form'!$H$433","v":200},{"$f":"'Data Update Form'!$H$433","v":200},{"$f":"'Data Update Form'!$H$433","v":200},{"$f":"'Data Update Form'!$H$433","v":200},{"$f":"'Data Update Form'!$H$433","v":200},{"$f":"'Data Update Form'!$H$433","v":200},{"$f":"'Data Update Form'!$H$433","v":200},{"$f":"'Data Update Form'!$H$433","v":200},{"$f":"'Data Update Form'!$H$433","v":200},{"$f":"'Data Update Form'!$H$433","v":200},{"$f":"'Data Update Form'!$H$433","v":200},{"$f":"'Data Update Form'!$H$433","v":200},{"$f":"'Data Update Form'!$H$433","v":200},"Potatoes",400,null,{"$f":"'Data Update Form'!$H$424","v":80},{"$f":"'Data Update Form'!$H$426","v":140},null,{"$f":"'Data Update Form'!$H$428","v":160},{"$f":"'Data Update Form'!$H$430","v":160},{"$f":"'Data Update Form'!$H$430","v":160},{"$f":"'Data Update Form'!$H$432","v":140},{"$f":"'Data Update Form'!$H$432","v":140},{"$f":"'Data Update Form'!$H$432","v":140},{"$f":"'Data Update Form'!$H$432","v":140},{"$f":"'Data Update Form'!$H$432","v":140},{"$f":"'Data Update Form'!$H$434","v":180},{"$f":"'Data Update Form'!$H$434","v":180},{"$f":"'Data Update Form'!$H$434","v":180},{"$f":"'Data Update Form'!$H$434","v":180},{"$f":"'Data Update Form'!$H$434","v":180},{"$f":"'Data Update Form'!$H$434","v":180},{"$f":"'Data Update Form'!$H$434","v":180},{"$f":"'Data Update Form'!$H$434","v":180},{"$f":"'Data Update Form'!$H$434","v":180},{"$f":"'Data Update Form'!$H$434","v":180},{"$f":"'Data Update Form'!$H$434","v":180},{"$f":"'Data Update Form'!$H$434","v":180},{"$f":"'Data Update Form'!$H$434","v":180},{"$f":"'Data Update Form'!$H$434","v":180}]
[101,"Potatoes",450,null,{"$f":"'Data Update Form'!$I$423","v":125},{"$f":"'Data Update Form'!$I$425","v":185},null,{"$f":"'Data Update Form'!$I$427","v":205},{"$f":"'Data Update Form'!$I$429","v":205},{"$f":"'Data Update Form'!$I$429","v":205},{"$f":"'Data Update Form'!$I$431","v":185},{"$f":"'Data Update Form'!$I$431","v":185},{"$f":"'Data Update Form'!$I$431","v":185},{"$f":"'Data Update Form'!$I$431","v":185},{"$f":"'Data Update Form'!$I$431","v":185},{"$f":"'Data Update Form'!$I$433","v":225},{"$f":"'Data Update Form'!$I$433","v":225},{"$f":"'Data Update Form'!$I$433","v":225},{"$f":"'Data Update Form'!$I$433","v":225},{"$f":"'Data Update Form'!$I$433","v":225},{"$f":"'Data Update Form'!$I$433","v":225},{"$f":"'Data Update Form'!$I$433","v":225},{"$f":"'Data Update Form'!$I$433","v":225},{"$f":"'Data Update Form'!$I$433","v":225},{"$f":"'Data Update Form'!$I$433","v":225},{"$f":"'Data Update Form'!$I$433","v":225},{"$f":"'Data Update Form'!$I$433","v":225},{"$f":"'Data Update Form'!$I$433","v":225},{"$f":"'Data Update Form'!$I$433","v":225},"Potatoes",450,null,{"$f":"'Data Update Form'!$I$424","v":105},{"$f":"'Data Update Form'!$I$426","v":165},null,{"$f":"'Data Update Form'!$I$428","v":185},{"$f":"'Data Update Form'!$I$430","v":185},{"$f":"'Data Update Form'!$I$430","v":185},{"$f":"'Data Update Form'!$I$432","v":165},{"$f":"'Data Update Form'!$I$432","v":165},{"$f":"'Data Update Form'!$I$432","v":165},{"$f":"'Data Update Form'!$I$432","v":165},{"$f":"'Data Update Form'!$I$432","v":165},{"$f":"'Data Update Form'!$I$434","v":205},{"$f":"'Data Update Form'!$I$434","v":205},{"$f":"'Data Update Form'!$I$434","v":205},{"$f":"'Data Update Form'!$I$434","v":205},{"$f":"'Data Update Form'!$I$434","v":205},{"$f":"'Data Update Form'!$I$434","v":205},{"$f":"'Data Update Form'!$I$434","v":205},{"$f":"'Data Update Form'!$I$434","v":205},{"$f":"'Data Update Form'!$I$434","v":205},{"$f":"'Data Update Form'!$I$434","v":205},{"$f":"'Data Update Form'!$I$434","v":205},{"$f":"'Data Update Form'!$I$434","v":205},{"$f":"'Data Update Form'!$I$434","v":205},{"$f":"'Data Update Form'!$I$434","v":205}]
[102,"Potatoes",500,null,{"$f":"'Data Update Form'!$J$423","v":150},{"$f":"'Data Update Form'!$J$425","v":210},null,{"$f":"'Data Update Form'!$J$427","v":230},{"$f":"'Data Update Form'!$J$429","v":230},{"$f":"'Data Update Form'!$J$429","v":230},{"$f":"'Data Update Form'!$J$431","v":210},{"$f":"'Data Update Form'!$J$431","v":210},{"$f":"'Data Update Form'!$J$431","v":210},{"$f":"'Data Update Form'!$J$431","v":210},{"$f":"'Data Update Form'!$J$431","v":210},{"$f":"'Data Update Form'!$J$433","v":250},{"$f":"'Data Update Form'!$J$433","v":250},{"$f":"'Data Update Form'!$J$433","v":250},{"$f":"'Data Update Form'!$J$433","v":250},{"$f":"'Data Update Form'!$J$433","v":250},{"$f":"'Data Update Form'!$J$433","v":250},{"$f":"'Data Update Form'!$J$433","v":250},{"$f":"'Data Update Form'!$J$433","v":250},{"$f":"'Data Update Form'!$J$433","v":250},{"$f":"'Data Update Form'!$J$433","v":250},{"$f":"'Data Update Form'!$J$433","v":250},{"$f":"'Data Update Form'!$J$433","v":250},{"$f":"'Data Update Form'!$J$433","v":250},{"$f":"'Data Update Form'!$J$433","v":250},"Potatoes",500,null,{"$f":"'Data Update Form'!$J$424","v":130},{"$f":"'Data Update Form'!$J$426","v":190},null,{"$f":"'Data Update Form'!$J$428","v":210},{"$f":"'Data Update Form'!$J$430","v":210},{"$f":"'Data Update Form'!$J$430","v":210},{"$f":"'Data Update Form'!$J$432","v":190},{"$f":"'Data Update Form'!$J$432","v":190},{"$f":"'Data Update Form'!$J$432","v":190},{"$f":"'Data Update Form'!$J$432","v":190},{"$f":"'Data Update Form'!$J$432","v":190},{"$f":"'Data Update Form'!$J$434","v":230},{"$f":"'Data Update Form'!$J$434","v":230},{"$f":"'Data Update Form'!$J$434","v":230},{"$f":"'Data Update Form'!$J$434","v":230},{"$f":"'Data Update Form'!$J$434","v":230},{"$f":"'Data Update Form'!$J$434","v":230},{"$f":"'Data Update Form'!$J$434","v":230},{"$f":"'Data Update Form'!$J$434","v":230},{"$f":"'Data Update Form'!$J$434","v":230},{"$f":"'Data Update Form'!$J$434","v":230},{"$f":"'Data Update Form'!$J$434","v":230},{"$f":"'Data Update Form'!$J$434","v":230},{"$f":"'Data Update Form'!$J$434","v":230},{"$f":"'Data Update Form'!$J$434","v":230}]
[]
[null,"Database_Legume"]
[null,"Crop","Max","Mid","Min"]
[null,"Barley",{"$f":"'Data Update Form'!$O$65","v":35},{"$f":"'Data Update Form'!$O$66","v":20},{"$f":"'Data Update Form'!$O$67","v":20}]
[null,"Corn",{"$f":"'Data Update Form'!$O$20","v":115},{"$f":"'Data Update Form'!$O$21","v":75},{"$f":"'Data Update Form'!$O$22","v":35}]
[null,"Sorghum",{"$f":"'Data Update Form'!$O$475","v":75},{"$f":"'Data Update Form'!$O$476","v":25},{"$f":"'Data Update Form'!$O$477","v":20}]
[null,"Wheat",{"$f":"'Data Update Form'!$O$43","v":35},{"$f":"'Data Update Form'!$O$45","v":20},{"$f":"'Data Update Form'!$O$45","v":20}]
[null,"HighP_Removal",null,null,null,"Names within chart are: N_Removal, P_Removal, K_Removal, P_Needs, K_Needs",null,null,null,null,"Calculated Value for P Needs",null,null,null,"Calculated Value for K Needs",null,null,"Corn_on_Sand"]
[null,"Crop","P2O5 Removal",null,null,"Crop","Lookup Yield","N Removal per unit of yield goal","P Removal per unit of yield goal","K Removal per unit of yield goal","W","X","Y","Z","A","B",null,"Crop","Lookup Yield","Row","Alfalfa-Old","Alfalfa-New",null,"Soybeans","Edible beans","peas","Clover/Trefoil","fallow","Grass/legume","Grass/Hay","Pasture","Corn","Wheat","Oats","Potatoes","SugarBeets","Rye","Barley","Buckwheat","Canola","Millet","sorghum","sunflowers","sweet corn","vegetables"]
[null,null,null,null,null,"CORN",0,"---",{"$f":"'Data Update Form'!$E$330","v":0.35},{"$f":"'Data Update Form'!$F$330","v":0.25},{"$f":"'Data Update Form'!$F$21","v":0.7},{"$f":"'Data Update Form'!$H$21","v":3.5000000000000003E-2},{"$f":"'Data Update Form'!$F$22","v":0.7},{"$f":"'Data Update Form'!$H$22","v":4.3999999999999997E-2},{"$f":"'Data Update Form'!F25","v":1.1659999999999999},{"$f":"'Data Update Form'!H25","v":7.3000000000000001E-3}]
[null,"Alfalfa",{"$f":"'Data Update Form'!$E322","v":12},null,null,"WHEAT",0,"---",{"$f":"('Data Update Form'!$E$347+'Data Update Form'!$E$348)/2","v":0.61},{"$f":"('Data Update Form'!$F$347+'Data Update Form'!$F$348)/2","v":0.91},{"$f":"'Data Update Form'!$P$39","v":1.071},{"$f":"'Data Update Form'!$R$39","v":5.3999999999999999E-2},{"$f":"'Data Update Form'!$P$40","v":1.071},{"$f":"'Data Update Form'!$R$40","v":6.7000000000000004E-2},{"$f":"'Data Update Form'!F45","v":2.71},{"$f":"'Data Update Form'!H45","v":1.7000000000000001E-2}]
[null,"Alsike Clover",{"$f":"'Data Update Form'!$E323","v":11},null,null,"BARLEY",0,"---",{"$f":"('Data Update Form'!$E$324+'Data Update Form'!$E$325)/2","v":0.48000000000000004},{"$f":"('Data Update Form'!$F$324+'Data Update Form'!$F$325)/2","v":0.92},{"$f":"'Data Update Form'!$P$61","v":0.78500000000000003},{"$f":"'Data Update Form'!$R$61","v":3.9E-2},{"$f":"'Data Update Form'!$P$62","v":0.78500000000000003},{"$f":"'Data Update Form'!$R$62","v":0.05},{"$f":"'Data Update Form'!F65","v":1.286},{"$f":"'Data Update Form'!H65","v":8.5000000000000006E-3},null,"CORN",0,null,{"$f":"'Data Update Form'!$AQ$7","v":150},{"$f":"'Data Update Form'!$AQ$9","v":170},null,{"$f":"'Data Update Form'!$AQ$11","v":205},{"$f":"'Data Update Form'!$AQ$13","v":215},{"$f":"'Data Update Form'!$AQ$13","v":215},{"$f":"'Data Update Form'!$AQ$15","v":160},{"$f":"'Data Update Form'!$AQ$15","v":160},{"$f":"'Data Update Form'!$AQ$15","v":160},{"$f":"'Data Update Form'!$AQ$15","v":160},{"$f":"'Data Update Form'!$AQ$15","v":160},{"$f":"'Data Update Form'!$AQ$17","v":235},{"$f":"'Data Update Form'!$AQ$17","v":235},{"$f":"'Data Update Form'!$AQ$17","v":235},{"$f":"'Data Update Form'!$AQ$17","v":235},{"$f":"'Data Update Form'!$AQ$17","v":235},{"$f":"'Data Update Form'!$AQ$17","v":235},{"$f":"'Data Update Form'!$AQ$17","v":235},{"$f":"'Data Update Form'!$AQ$17","v":235},{"$f":"'Data Update Form'!$AQ$17","v":235},{"$f":"'Data Update Form'!$AQ$17","v":235},{"$f":"'Data Update Form'!$AQ$17","v":235},{"$f":"'Data Update Form'!$AQ$17","v":235},{"$f":"'Data Update Form'!$AQ$17","v":235},{"$f":"'Data Update Form'!$AQ$17","v":235}]
[null,"Barley",{"$f":"'Data Update Form'!$E324","v":0.4},null,null,"OATS",0,"---",{"$f":"('Data Update Form'!$E$336+'Data Update Form'!$E$337)/2","v":0.36},{"$f":"('Data Update Form'!$F$336+'Data Update Form'!$F$337)/2","v":0.65999999999999992},{"$f":"'Data Update Form'!$P$83","v":0.64400000000000002},{"$f":"'Data Update Form'!$R$83","v":3.2000000000000001E-2},{"$f":"'Data Update Form'!$P$84","v":0.64400000000000002},{"$f":"'Data Update Form'!$R$84","v":4.1000000000000002E-2},{"$f":"'Data Update Form'!F87","v":1.2769999999999999},{"$f":"'Data Update Form'!H87","v":8.6E-3},null,"CORN",100,null,{"$f":"'Data Update Form'!$AR$7","v":150},{"$f":"'Data Update Form'!$AR$9","v":170},null,{"$f":"'Data Update Form'!$AR$11","v":205},{"$f":"'Data Update Form'!$AR$13","v":215},{"$f":"'Data Update Form'!$AR$13","v":215},{"$f":"'Data Update Form'!$AR$15","v":160},{"$f":"'Data Update Form'!$AR$15","v":160},{"$f":"'Data Update Form'!$AR$15","v":160},{"$f":"'Data Update Form'!$AR$15","v":160},{"$f":"'Data Update Form'!$AR$15","v":160},{"$f":"'Data Update Form'!$AR$17","v":235},{"$f":"'Data Update Form'!$AR$17","v":235},{"$f":"'Data Update Form'!$AR$17","v":235},{"$f":"'Data Update Form'!$AR$17","v":235},{"$f":"'Data Update Form'!$AR$17","v":235},{"$f":"'Data Update Form'!$AR$17","v":235},{"$f":"'Data Update Form'!$AR$17","v":235},{"$f":"'Data Update Form'!$AR$17","v":235},{"$f":"'Data Update Form'!$AR$17","v":235},{"$f":"'Data Update Form'!$AR$17","v":235},{"$f":"'Data Update Form'!$AR$17","v":235},{"$f":"'Data Update Form'!$AR$17","v":235},{"$f":"'Data Update Form'!$AR$17","v":235},{"$f":"'Data Update Form'!$AR$17","v":235}]
[null,"Barley w/ Straw",{"$f":"'Data Update Form'!$E325","v":0.56000000000000005},null,null,"ALFALFA",0,{"$f":"'Data Update Form'!$D$322","v":51},{"$f":"'Data Update Form'!$E$322","v":12},{"$f":"'Data Update Form'!$F$322","v":49},{"$f":"'Data Update Form'!$P$224","v":18.57},{"$f":"'Data Update Form'!$R$224","v":0.93},{"$f":"'Data Update Form'!$P$225","v":18.57},{"$f":"'Data Update Form'!$R$225","v":1.1599999999999999},{"$f":"'Data Update Form'!P227","v":55.7},{"$f":"'Data Update Form'!R227","v":0.38},null,"CORN",125,null,{"$f":"'Data Update Form'!$AS$7","v":150},{"$f":"'Data Update Form'!$AS$9","v":170},null,{"$f":"'Data Update Form'!$AS$11","v":205},{"$f":"'Data Update Form'!$AS$13","v":215},{"$f":"'Data Update Form'!$AS$13","v":215},{"$f":"'Data Update Form'!$AS$15","v":160},{"$f":"'Data Update Form'!$AS$15","v":160},{"$f":"'Data Update Form'!$AS$15","v":160},{"$f":"'Data Update Form'!$AS$15","v":160},{"$f":"'Data Update Form'!$AS$15","v":160},{"$f":"'Data Update Form'!$AS$17","v":235},{"$f":"'Data Update Form'!$AS$17","v":235},{"$f":"'Data Update Form'!$AS$17","v":235},{"$f":"'Data Update Form'!$AS$17","v":235},{"$f":"'Data Update Form'!$AS$17","v":235},{"$f":"'Data Update Form'!$AS$17","v":235},{"$f":"'Data Update Form'!$AS$17","v":235},{"$f":"'Data Update Form'!$AS$17","v":235},{"$f":"'Data Update Form'!$AS$17","v":235},{"$f":"'Data Update Form'!$AS$17","v":235},{"$f":"'Data Update Form'!$AS$17","v":235},{"$f":"'Data Update Form'!$AS$17","v":235},{"$f":"'Data Update Form'!$AS$17","v":235},{"$f":"'Data Update Form'!$AS$17","v":235}]
[null,"Birdsfoot Trefoil",{"$f":"'Data Update Form'!$E326","v":11},null,null,"GRASS/HAY",0,{"$f":"'Data Update Form'!$D$333","v":27.06},{"$f":"'Data Update Form'!$E$333","v":3.9},{"$f":"'Data Update Form'!$F$333","v":25.83},{"$f":"'Data Update Form'!$P$240","v":19.12},{"$f":"'Data Update Form'!$R$240","v":0.73199999999999998},{"$f":"'Data Update Form'!$P$241","v":19.12},{"$f":"'Data Update Form'!$R$241","v":1.012},{"$f":"'Data Update Form'!P243","v":40.43},{"$f":"'Data Update Form'!R243","v":0.28599999999999998},null,"CORN",150,null,{"$f":"'Data Update Form'!$AT$7","v":150},{"$f":"'Data Update Form'!$AT$9","v":170},null,{"$f":"'Data Update Form'!$AT$11","v":205},{"$f":"'Data Update Form'!$AT$13","v":215},{"$f":"'Data Update Form'!$AT$13","v":215},{"$f":"'Data Update Form'!$AT$15","v":160},{"$f":"'Data Update Form'!$AT$15","v":160},{"$f":"'Data Update Form'!$AT$15","v":160},{"$f":"'Data Update Form'!$AT$15","v":160},{"$f":"'Data Update Form'!$AT$15","v":160},{"$f":"'Data Update Form'!$AT$17","v":235},{"$f":"'Data Update Form'!$AT$17","v":235},{"$f":"'Data Update Form'!$AT$17","v":235},{"$f":"'Data Update Form'!$AT$17","v":235},{"$f":"'Data Update Form'!$AT$17","v":235},{"$f":"'Data Update Form'!$AT$17","v":235},{"$f":"'Data Update Form'!$AT$17","v":235},{"$f":"'Data Update Form'!$AT$17","v":235},{"$f":"'Data Update Form'!$AT$17","v":235},{"$f":"'Data Update Form'!$AT$17","v":235},{"$f":"'Data Update Form'!$AT$17","v":235},{"$f":"'Data Update Form'!$AT$17","v":235},{"$f":"'Data Update Form'!$AT$17","v":235},{"$f":"'Data Update Form'!$AT$17","v":235}]
[null,"Buckwheat",{"$f":"'Data Update Form'!$E327","v":0.25},null,null,"SOYBEANS",0,{"$f":"'Data Update Form'!$D$343","v":3.5},{"$f":"'Data Update Form'!$E$343","v":0.82},{"$f":"'Data Update Form'!$F$343","v":1},{"$f":"'Data Update Form'!$P$265","v":1.752},{"$f":"'Data Update Form'!$R$265","v":8.3599999999999994E-2},{"$f":"'Data Update Form'!$P$266","v":1.752},{"$f":"'Data Update Form'!$R$266","v":0.1114},{"$f":"'Data Update Form'!P268","v":2.2000000000000002},{"$f":"'Data Update Form'!R268","v":0.183},null,"CORN",175,null,{"$f":"'Data Update Form'!$AU$7","v":150},{"$f":"'Data Update Form'!$AU$9","v":170},null,{"$f":"'Data Update Form'!$AU$11","v":205},{"$f":"'Data Update Form'!$AU$13","v":215},{"$f":"'Data Update Form'!$AU$13","v":215},{"$f":"'Data Update Form'!$AU$15","v":160},{"$f":"'Data Update Form'!$AU$15","v":160},{"$f":"'Data Update Form'!$AU$15","v":160},{"$f":"'Data Update Form'!$AU$15","v":160},{"$f":"'Data Update Form'!$AU$15","v":160},{"$f":"'Data Update Form'!$AU$17","v":235},{"$f":"'Data Update Form'!$AU$17","v":235},{"$f":"'Data Update Form'!$AU$17","v":235},{"$f":"'Data Update Form'!$AU$17","v":235},{"$f":"'Data Update Form'!$AU$17","v":235},{"$f":"'Data Update Form'!$AU$17","v":235},{"$f":"'Data Update Form'!$AU$17","v":235},{"$f":"'Data Update Form'!$AU$17","v":235},{"$f":"'Data Update Form'!$AU$17","v":235},{"$f":"'Data Update Form'!$AU$17","v":235},{"$f":"'Data Update Form'!$AU$17","v":235},{"$f":"'Data Update Form'!$AU$17","v":235},{"$f":"'Data Update Form'!$AU$17","v":235},{"$f":"'Data Update Form'!$AU$17","v":235}]
[null,"Buckwheat w/ Straw",{"$f":"'Data Update Form'!$E328","v":1.95},null,null,"SILAGE",0,{"$f":"'Data Update Form'!$D$331","v":9.6999999999999993},{"$f":"'Data Update Form'!$E$331","v":3.1},{"$f":"'Data Update Form'!$F$331","v":7.3},{"$f":"'Data Update Form'!$F$21","v":0.7},{"$f":"'Data Update Form'!$H$21","v":3.5000000000000003E-2},{"$f":"'Data Update Form'!$F$22","v":0.7},{"$f":"'Data Update Form'!$H$22","v":4.3999999999999997E-2},{"$f":"'Data Update Form'!F25","v":1.1659999999999999},{"$f":"'Data Update Form'!H25","v":7.3000000000000001E-3},null,"CORN",200,null,{"$f":"'Data Update Form'!$AV$7","v":150},{"$f":"'Data Update Form'!$AV$9","v":170},null,{"$f":"'Data Update Form'!$AV$11","v":205},{"$f":"'Data Update Form'!$AV$13","v":215},{"$f":"'Data Update Form'!$AV$13","v":215},{"$f":"'Data Update Form'!$AV$15","v":160},{"$f":"'Data Update Form'!$AV$15","v":160},{"$f":"'Data Update Form'!$AV$15","v":160},{"$f":"'Data Update Form'!$AV$15","v":160},{"$f":"'Data Update Form'!$AV$15","v":160},{"$f":"'Data Update Form'!$AV$17","v":235},{"$f":"'Data Update Form'!$AV$17","v":235},{"$f":"'Data Update Form'!$AV$17","v":235},{"$f":"'Data Update Form'!$AV$17","v":235},{"$f":"'Data Update Form'!$AV$17","v":235},{"$f":"'Data Update Form'!$AV$17","v":235},{"$f":"'Data Update Form'!$AV$17","v":235},{"$f":"'Data Update Form'!$AV$17","v":235},{"$f":"'Data Update Form'!$AV$17","v":235},{"$f":"'Data Update Form'!$AV$17","v":235},{"$f":"'Data Update Form'!$AV$17","v":235},{"$f":"'Data Update Form'!$AV$17","v":235},{"$f":"'Data Update Form'!$AV$17","v":235},{"$f":"'Data Update Form'!$AV$17","v":235}]
[null,"Canola",{"$f":"'Data Update Form'!$E329","v":0.8},null,null,"Buckwheat",0,"---",{"$f":"('Data Update Form'!$E$327+'Data Update Form'!$E$328)/2","v":1.1000000000000001},{"$f":"('Data Update Form'!$F$327+'Data Update Form'!$F$328)/2","v":23.445},{"$f":"'Data Update Form'!$P$103","v":2.75E-2},{"$f":"'Data Update Form'!$R$103","v":1.4E-3},{"$f":"'Data Update Form'!$P$104","v":2.75E-2},{"$f":"'Data Update Form'!$R$104","v":1.6999999999999999E-3},{"$f":"'Data Update Form'!F107","v":3.5799999999999998E-2},{"$f":"'Data Update Form'!H107","v":2.3E-2}]
[null,"Corn",{"$f":"'Data Update Form'!$E330","v":0.35},null,null,"Canola",0,"---",{"$f":"'Data Update Form'!$E$329","v":0.8},{"$f":"'Data Update Form'!$F$329","v":0.4},{"$f":"'Data Update Form'!$P$123","v":3.6},{"$f":"'Data Update Form'!$R$123","v":0.17},{"$f":"'Data Update Form'!$P$124","v":3.6},{"$f":"'Data Update Form'!$R$124","v":0.22},{"$f":"'Data Update Form'!F127","v":5.4},{"$f":"'Data Update Form'!H127","v":3.4000000000000002E-2},null,"Database_Legume_Sand"]
[null,"Corn Silage",{"$f":"'Data Update Form'!$E331","v":3.1},null,null,"Edible Beans",0,"---",{"$f":"'Data Update Form'!$E$332","v":1.2999999999999999E-2},{"$f":"'Data Update Form'!$F$332","v":1.4999999999999999E-2},{"$f":"'Data Update Form'!$P$143","v":2.3099999999999999E-2},{"$f":"'Data Update Form'!$R$143","v":1.1000000000000001E-3},{"$f":"'Data Update Form'!$P$144","v":2.3099999999999999E-2},{"$f":"'Data Update Form'!$R$144","v":1.4E-3},{"$f":"'Data Update Form'!F147","v":3.4599999999999999E-2},{"$f":"'Data Update Form'!H147","v":2.0999999999999999E-3},null,"Crop","Max","Mid","Min"]
[null,"Edible Beans",{"$f":"'Data Update Form'!$E332","v":1.2999999999999999E-2},null,null,"Grass/Legume",0,{"$f":"'Data Update Form'!$D$334","v":40.17},{"$f":"'Data Update Form'!$E$334","v":4.07},{"$f":"'Data Update Form'!$F$334","v":25.11},{"$f":"'Data Update Form'!$P$293","v":20},{"$f":"'Data Update Form'!$R$293","v":1},{"$f":"'Data Update Form'!$P$294","v":20},{"$f":"'Data Update Form'!$R$294","v":1.4},{"$f":"'Data Update Form'!P296","v":53.28},{"$f":"'Data Update Form'!R296","v":0.33300000000000002},null,"Corn",{"$f":"'Data Update Form'!AG16","v":85},{"$f":"'Data Update Form'!AG17","v":65},{"$f":"'Data Update Form'!AG18","v":35}]
[null,"Grass/Hay",{"$f":"'Data Update Form'!$E333","v":3.9},null,null,"Millet",0,"---",{"$f":"'Data Update Form'!$E$335","v":0.4},{"$f":"'Data Update Form'!$F$335","v":0.4},{"$f":"'Data Update Form'!$P$163","v":1.7100000000000001E-2},{"$f":"'Data Update Form'!$R$163","v":8.5000000000000006E-3},{"$f":"'Data Update Form'!$P$164","v":1.7100000000000001E-2},{"$f":"'Data Update Form'!$R$164","v":1.14E-3},{"$f":"'Data Update Form'!F167","v":0.03},{"$f":"'Data Update Form'!H167","v":1.8000000000000001E-4}]
[null,"Grass/Legume",{"$f":"'Data Update Form'!$E334","v":4.07},null,null,"Alsike Clover",0,{"$f":"('Data Update Form'!$D$323+'Data Update Form'!$D$326+'Data Update Form'!$D$340)/3","v":43.666666666666664},{"$f":"('Data Update Form'!$E$323+'Data Update Form'!$E$326+'Data Update Form'!$E$340)/3","v":11.333333333333334},{"$f":"('Data Update Form'!$F$323+'Data Update Form'!$F$326+'Data Update Form'!$F$340)/3","v":46},{"$f":"'Data Update Form'!$P$309","v":20},{"$f":"'Data Update Form'!$R$309","v":1},{"$f":"'Data Update Form'!$P$310","v":20},{"$f":"'Data Update Form'!$R$310","v":1.4},{"$f":"'Data Update Form'!P312","v":53.28},{"$f":"'Data Update Form'!R312","v":0.33300000000000002},null,null,"Fertilizer","N","P","Weight","Liquid?","K","short fertilizer name"]
[null,"Millet",{"$f":"'Data Update Form'!$E335","v":0.4},null,null,"Birdsfoot Trefoil",0,{"$f":"('Data Update Form'!$D$323+'Data Update Form'!$D$326+'Data Update Form'!$D$340)/3","v":43.666666666666664},{"$f":"('Data Update Form'!$E$323+'Data Update Form'!$E$326+'Data Update Form'!$E$340)/3","v":11.333333333333334},{"$f":"('Data Update Form'!$F$323+'Data Update Form'!$F$326+'Data Update Form'!$F$340)/3","v":46},{"$f":"'Data Update Form'!$P$309","v":20},{"$f":"'Data Update Form'!$R$309","v":1},{"$f":"'Data Update Form'!$P$310","v":20},{"$f":"'Data Update Form'!$R$310","v":1.4},{"$f":"'Data Update Form'!P312","v":53.28},{"$f":"'Data Update Form'!R312","v":0.33300000000000002},null,null,{"$f":"'Data Update Form'!K332","v":"UAN (28% N)"},{"$f":"'Data Update Form'!L332","v":28},{"$f":"'Data Update Form'!M332","v":0},{"$f":"'Data Update Form'!N332","v":10.66},{"$f":"'Data Update Form'!O332","v":"gal/acre"},{"$f":"'Data Update Form'!P332","v":0},{"$f":"S130","v":"UAN (28% N)"}]
[null,"Oats",{"$f":"'Data Update Form'!$E336","v":0.28000000000000003},null,null,"Red Clover",0,{"$f":"('Data Update Form'!$D$323+'Data Update Form'!$D$326+'Data Update Form'!$D$340)/3","v":43.666666666666664},{"$f":"('Data Update Form'!$E$323+'Data Update Form'!$E$326+'Data Update Form'!$E$340)/3","v":11.333333333333334},{"$f":"('Data Update Form'!$F$323+'Data Update Form'!$F$326+'Data Update Form'!$F$340)/3","v":46},{"$f":"'Data Update Form'!$P$309","v":20},{"$f":"'Data Update Form'!$R$309","v":1},{"$f":"'Data Update Form'!$P$310","v":20},{"$f":"'Data Update Form'!$R$310","v":1.4},{"$f":"'Data Update Form'!P312","v":53.28},{"$f":"'Data Update Form'!R312","v":0.33300000000000002},null,null,{"$f":"'Data Update Form'!K333","v":"UAN (32% N)"},{"$f":"'Data Update Form'!L333","v":32},{"$f":"'Data Update Form'!M333","v":0},{"$f":"'Data Update Form'!N333","v":11.06},{"$f":"'Data Update Form'!O333","v":"gal/acre"},{"$f":"'Data Update Form'!P333","v":0},{"$f":"S131","v":"UAN (32% N)"}]
[null,"Oats w/ Straw",{"$f":"'Data Update Form'!$E337","v":0.44},null,null,"Rye",0,"---",{"$f":"('Data Update Form'!$E$341+'Data Update Form'!$E$342)/2","v":0.56500000000000006},{"$f":"('Data Update Form'!$F$341+'Data Update Form'!$F$342)/2","v":1.06},{"$f":"'Data Update Form'!$P$183","v":1.071},{"$f":"'Data Update Form'!$R$183","v":5.3999999999999999E-2},{"$f":"'Data Update Form'!$P$184","v":1.071},{"$f":"'Data Update Form'!$R$184","v":6.7000000000000004E-2},{"$f":"'Data Update Form'!F187","v":2.71},{"$f":"'Data Update Form'!H187","v":0.17},null,null,{"$f":"'Data Update Form'!K334","v":"Liquid 10-34-0"},{"$f":"'Data Update Form'!L334","v":10},{"$f":"'Data Update Form'!M334","v":34},{"$f":"'Data Update Form'!N334","v":11.65},{"$f":"'Data Update Form'!O334","v":"gal/acre"},{"$f":"'Data Update Form'!P334","v":0},{"$f":"IFERROR(LEFT(S132,FIND(\"(\",S132)-2),S132)","v":"Liquid 10-34-0"}]
[null,"Peas",{"$f":"'Data Update Form'!$E338","v":0.01},null,null,"Sugarbeets",0,"---",{"$f":"'Data Update Form'!$E$344","v":2.2000000000000002},{"$f":"'Data Update Form'!$F$344","v":7.3},null,null,null,null,null,null,null,null,{"$f":"'Data Update Form'!K335","v":"Liquid 9-18-9"},{"$f":"'Data Update Form'!L335","v":9},{"$f":"'Data Update Form'!M335","v":18},{"$f":"'Data Update Form'!N335","v":11.11},{"$f":"'Data Update Form'!O335","v":"gal/acre"},{"$f":"'Data Update Form'!P335","v":9},"Liquid 9-18-9"]
[null,"Potatoes",{"$f":"'Data Update Form'!$E339","v":0.15},null,null,"Sunflowers",0,"---",{"$f":"'Data Update Form'!$E$345","v":0.97},{"$f":"'Data Update Form'!$F$345","v":0.9},{"$f":"'Data Update Form'!$P$203","v":2.2499999999999999E-2},{"$f":"'Data Update Form'!$R$203","v":1.1000000000000001E-3},{"$f":"'Data Update Form'!$P$204","v":2.2499999999999999E-2},{"$f":"'Data Update Form'!$R$204","v":1.4E-3},{"$f":"'Data Update Form'!F206","v":4.1000000000000002E-2},{"$f":"'Data Update Form'!H206","v":2.7E-4},null,null,{"$f":"'Data Update Form'!K336","v":"Liquid 7-21-7"},{"$f":"'Data Update Form'!L336","v":7},{"$f":"'Data Update Form'!M336","v":21},{"$f":"'Data Update Form'!N336","v":11},{"$f":"'Data Update Form'!O336","v":"gal/acre"},{"$f":"'Data Update Form'!P336","v":7},"Liquid 7-21-7"]
[null,"Red Clover",{"$f":"'Data Update Form'!$E340","v":12},null,null,"Sweet Corn",0,"---",{"$f":"'Data Update Form'!$E$346","v":11},{"$f":"'Data Update Form'!$F$346","v":13.9},{"$f":"'Data Update Form'!$P$392","v":11},{"$f":"'Data Update Form'!$R$392","v":0.53300000000000003},{"$f":"'Data Update Form'!$P$393","v":11},{"$f":"'Data Update Form'!$R$393","v":0.7},{"$f":"'Data Update Form'!F397","v":22},{"$f":"'Data Update Form'!H397","v":0.13},null,null,{"$f":"'Data Update Form'!K337","v":"Liquid Amm. Thiosulfate (12-0-0-26)"},{"$f":"'Data Update Form'!L337","v":12},{"$f":"'Data Update Form'!M337","v":0},{"$f":"'Data Update Form'!N337","v":11},{"$f":"'Data Update Form'!O337","v":"gal/acre"},{"$f":"'Data Update Form'!P337","v":0},"Liquid Amm. Thiosulfate"]
[null,"Rye",{"$f":"'Data Update Form'!$E341","v":0.46},null,null,"Peas",0,"---",{"$f":"'Data Update Form'!$E$338","v":0.01},{"$f":"'Data Update Form'!$F$338","v":0.01},{"$f":"'Data Update Form'!$P$412","v":1.7100000000000001E-2},{"$f":"'Data Update Form'!$R$412","v":8.4999999999999995E-4},{"$f":"'Data Update Form'!$P$413","v":1.7100000000000001E-2},{"$f":"'Data Update Form'!$R$413","v":1.1000000000000001E-3},{"$f":"'Data Update Form'!F417","v":0.03},{"$f":"'Data Update Form'!H417","v":1.8000000000000001E-4},null,null,{"$f":"'Data Update Form'!K338","v":"Urea (46% N)"},{"$f":"'Data Update Form'!L338","v":46},{"$f":"'Data Update Form'!M338","v":0},{"$f":"'Data Update Form'!N338","v":"N/A"},{"$f":"'Data Update Form'!O338","v":"lbs/acre"},{"$f":"'Data Update Form'!P338","v":0},"Urea"]
[null,"Rye w/ Straw",{"$f":"'Data Update Form'!$E342","v":0.67},null,null,"Sorghum",0,"---",{"$f":"'Data Update Form'!$E$351","v":9.5},{"$f":"'Data Update Form'!$F$351","v":34},{"$f":"'Data Update Form'!$P$468","v":11},{"$f":"'Data Update Form'!$R$468","v":0.53300000000000003},{"$f":"'Data Update Form'!$P$469","v":11},{"$f":"'Data Update Form'!$R$469","v":0.7},{"$f":"'Data Update Form'!F473","v":43},{"$f":"'Data Update Form'!H473","v":0.3},null,null,{"$f":"'Data Update Form'!K339","v":"Anhydrous Ammonia (82% N)"},{"$f":"'Data Update Form'!L339","v":82},{"$f":"'Data Update Form'!M339","v":0},{"$f":"'Data Update Form'!N339","v":"N/A"},{"$f":"'Data Update Form'!O339","v":"lbs/acre"},{"$f":"'Data Update Form'!P339","v":0},"Anhydrous Ammonia"]
[null,"Sorghum",{"$f":"'Data Update Form'!$E$351","v":9.5},null,null,"Potatoes",0,"---",{"$f":"'Data Update Form'!$E$339","v":0.15},{"$f":"'Data Update Form'!$F$339","v":0.65},{"$f":"'Data Update Form'!$F$450","v":0.5},{"$f":"'Data Update Form'!$H$450","v":2.4E-2},{"$f":"'Data Update Form'!$F$451","v":0.5},{"$f":"'Data Update Form'!$H$451","v":3.4000000000000002E-2},{"$f":"'Data Update Form'!F453","v":0.85},{"$f":"'Data Update Form'!H453","v":5.7000000000000002E-3},null,null,{"$f":"'Data Update Form'!K340","v":"Ammonium Sulfate (21-0-0-26S)"},{"$f":"'Data Update Form'!L340","v":21},{"$f":"'Data Update Form'!M340","v":0},{"$f":"'Data Update Form'!N340","v":"N/A"},{"$f":"'Data Update Form'!O340","v":"lbs/acre"},{"$f":"'Data Update Form'!P340","v":0},"Ammonium Sulfate"]
[null,"Soybeans",{"$f":"'Data Update Form'!$E343","v":0.82},null,null,null,null,null,null,null,null,null,null,null,null,null,null,null,{"$f":"'Data Update Form'!K341","v":"DAP (18-46-0)"},{"$f":"'Data Update Form'!L341","v":18},{"$f":"'Data Update Form'!M341","v":46},{"$f":"'Data Update Form'!N341","v":"N/A"},{"$f":"'Data Update Form'!O341","v":"lbs/acre"},{"$f":"'Data Update Form'!P341","v":0},"DAP"]
[null,"Sugarbeets",{"$f":"'Data Update Form'!$E344","v":2.2000000000000002},null,null,null,null,null,null,null,null,null,null,null,null,null,null,null,{"$f":"'Data Update Form'!K342","v":"MAP (11-48-0)"},{"$f":"'Data Update Form'!L342","v":11},{"$f":"'Data Update Form'!M342","v":48},{"$f":"'Data Update Form'!N342","v":"N/A"},{"$f":"'Data Update Form'!O342","v":"lbs/acre"},{"$f":"'Data Update Form'!P342","v":0},"MAP"]
[null,"Sunflowers",{"$f":"'Data Update Form'!$E345","v":0.97},null,null,null,null,null,null,null,null,null,null,null,null,null,null,null,{"$f":"'Data Update Form'!K343","v":"Triple Superphosphate (0-46-0)"},{"$f":"'Data Update Form'!L343","v":0},{"$f":"'Data Update Form'!M343","v":46},{"$f":"'Data Update Form'!N343","v":"N/A"},{"$f":"'Data Update Form'!O343","v":"lbs/acre"},{"$f":"'Data Update Form'!P343","v":0},"Triple Superphosphate"]
[null,"Sweet Corn",{"$f":"'Data Update Form'!$E346","v":11},null,null,null,null,null,null,null,null,null,null,null,null,null,null,null,{"$f":"'Data Update Form'!K344","v":"Blend 5-14-42"},{"$f":"'Data Update Form'!L344","v":5},{"$f":"'Data Update Form'!M344","v":15},{"$f":"'Data Update Form'!N344","v":"N/A"},{"$f":"'Data Update Form'!O344","v":"lbs/acre"},{"$f":"'Data Update Form'!P344","v":42},"Blend 5-14-42"]
[null,"Wheat",{"$f":"'Data Update Form'!$E347","v":0.53},null,null,null,null,null,null,null,null,null,null,null,null,null,null,null,{"$f":"'Data Update Form'!K345","v":"Blend 9-23-30"},{"$f":"'Data Update Form'!L345","v":9},{"$f":"'Data Update Form'!M345","v":23},{"$f":"'Data Update Form'!N345","v":"N/A"},{"$f":"'Data Update Form'!O345","v":"lbs/acre"},{"$f":"'Data Update Form'!P345","v":30},"Blend 9-23-30"]
[null,"Wheat w/ Straw",{"$f":"'Data Update Form'!$E348","v":0.69},null,null,null,null,null,null,null,null,null,null,null,null,null,null,null,{"$f":"'Data Update Form'!K346","v":"Potassium Chloride (0-0-60)"},{"$f":"'Data Update Form'!L346","v":0},{"$f":"'Data Update Form'!M346","v":0},{"$f":"'Data Update Form'!N346","v":"N/A"},{"$f":"'Data Update Form'!O346","v":"lbs/acre"},{"$f":"'Data Update Form'!P346","v":60},"Potassium Chloride"]
[null,null,null,null,null,null,null,null,null,null,null,null,null,null,null,null,null,null,{"$f":"'Data Update Form'!K347","v":"Potassium Sulfate (0-0-50-18(S))"},{"$f":"'Data Update Form'!L347","v":0},{"$f":"'Data Update Form'!M347","v":0},{"$f":"'Data Update Form'!N347","v":"N/A"},{"$f":"'Data Update Form'!O347","v":"lbs/acre"},{"$f":"'Data Update Form'!P347","v":50},"Potassium Sulfate"]
[null,null,null,null,null,null,null,null,null,null,null,null,null,null,null,null,null,null,{"$f":"'Data Update Form'!K348","v":"Sul-Po-Mag (0-0-22-22(S)-11(Mg))"},{"$f":"'Data Update Form'!L348","v":0},{"$f":"'Data Update Form'!M348","v":0},{"$f":"'Data Update Form'!N348","v":"N/A"},{"$f":"'Data Update Form'!O348","v":"lbs/acre"},{"$f":"'Data Update Form'!P348","v":22},"Sul-Po-Mag"]
[null,"Names in Chart include: Animal_type, Production, Typical_tests",null,null,null,null,null,null,null,null,null,null,null,null,null,null,null,null,{"$f":"'Data Update Form'!K349","v":"Potassium Nitrate (13-0-44)"},{"$f":"'Data Update Form'!L349","v":13},{"$f":"'Data Update Form'!M349","v":0},{"$f":"'Data Update Form'!N349","v":"N/A"},{"$f":"'Data Update Form'!O349","v":"lbs/acre"},{"$f":"'Data Update Form'!P349","v":44},"Potassium Nitrate"]
[null,null,"Manure Production per 1,000 lbs. of Animal Weight",null,"Excreted Nutrients in Manure per 1,000 lbs. of Animal Weight",null,null,"Evaporative Losses",null,null,null,"Typical Nutrient Contents",null,null,null,null,null,null,{"$f":"'Data Update Form'!K350","v":"Custom"},{"$f":"'Data Update Form'!L350","v":0},{"$f":"'Data Update Form'!M350","v":0},{"$f":"'Data Update Form'!N350","v":0},{"$f":"'Data Update Form'!O350","v":0},{"$f":"'Data Update Form'!P350","v":0},"Custom"]
[null,null,"(tons/year)","(gallons/year)","(lbs per year)","(lbs per year)","(lbs per year)","(value of 1 Cancels out in calcs)",null,null,null,"Liquid",null,null,"Solid"]
[null,"Animal Type","Solid","Liquid","N","P2O5","K20","Scrape and Haul/Stockpile/Underfloor Dry","Manure PBAk","Litter","animal type 2","N","P","K","N","P","K"]
[null,"Beef Calf",{"$f":"'Data Update Form'!B215","v":19.419871794871796},{"$f":"'Data Update Form'!C215","v":4592.136752136752},{"$f":"'Data Update Form'!D215","v":162.53418803418805},{"$f":"'Data Update Form'!E215","v":73},{"$f":"'Data Update Form'!F215","v":129.46581196581195},{"$f":"'Data Update Form'!B373","v":0.68303571428571441},{"$f":"'Data Update Form'!E373","v":0.63750000000000007},{"$f":"'Data Update Form'!G373","v":1},"Beef",{"$f":"'Data Update Form'!B268","v":27},{"$f":"'Data Update Form'!C268","v":18},{"$f":"'Data Update Form'!D268","v":24},{"$f":"'Data Update Form'!E268","v":9},{"$f":"'Data Update Form'!F268","v":4},{"$f":"'Data Update Form'!G268","v":8}]
[null,"Beef Feeder (High forage)",{"$f":"'Data Update Form'!B216","v":8.9812121212121205},{"$f":"'Data Update Form'!C216","v":2142.439393939394},{"$f":"'Data Update Form'!D216","v":132.06363636363636},{"$f":"'Data Update Form'!E216","v":39.375757575757575},{"$f":"'Data Update Form'!F216","v":82.843939393939394},{"$f":"'Data Update Form'!B371","v":0.68303571428571441},{"$f":"'Data Update Form'!E371","v":0.63750000000000007},{"$f":"'Data Update Form'!G371","v":1},"Beef",{"$f":"'Data Update Form'!B265","v":29},{"$f":"'Data Update Form'!C265","v":18},{"$f":"'Data Update Form'!D265","v":26},{"$f":"'Data Update Form'!E265","v":11},{"$f":"'Data Update Form'!F265","v":7},{"$f":"'Data Update Form'!G265","v":11}]
[null,"Beef Feeder (High energy)",{"$f":"'Data Update Form'!B217","v":8.9812121212121205},{"$f":"'Data Update Form'!C217","v":2142.439393939394},{"$f":"'Data Update Form'!D217","v":132.06363636363636},{"$f":"'Data Update Form'!E217","v":39.375757575757575},{"$f":"'Data Update Form'!F217","v":82.843939393939394},{"$f":"'Data Update Form'!B372","v":0.68303571428571441},{"$f":"'Data Update Form'!E372","v":0.63750000000000007},{"$f":"'Data Update Form'!G372","v":1},"Beef",{"$f":"'Data Update Form'!B266","v":29},{"$f":"'Data Update Form'!C266","v":18},{"$f":"'Data Update Form'!D266","v":26},{"$f":"'Data Update Form'!E266","v":11},{"$f":"'Data Update Form'!F266","v":7},{"$f":"'Data Update Form'!G266","v":11}]
[null,"Beef Cow",{"$f":"'Data Update Form'!B218","v":16.79},{"$f":"'Data Update Form'!C218","v":3982.15},{"$f":"'Data Update Form'!D218","v":127.74999999999999},{"$f":"'Data Update Form'!E218","v":65.7},{"$f":"'Data Update Form'!F218","v":105.85},{"$f":"'Data Update Form'!B373","v":0.68303571428571441},{"$f":"'Data Update Form'!E373","v":0.63750000000000007},{"$f":"'Data Update Form'!G373","v":1},"Beef",{"$f":"'Data Update Form'!B267","v":20},{"$f":"'Data Update Form'!C267","v":16},{"$f":"'Data Update Form'!D267","v":24},{"$f":"'Data Update Form'!E267","v":7},{"$f":"'Data Update Form'!F267","v":4},{"$f":"'Data Update Form'!G267","v":7}]
[null,"Dairy Calf",{"$f":"'Data Update Form'!B220","v":14.6},{"$f":"'Data Update Form'!C220","v":3357.9999999999995},{"$f":"'Data Update Form'!D220","v":153.30000000000001},{"$f":"'Data Update Form'!E220","v":26.766666666666666},{"$f":"'Data Update Form'!F220","v":126.53333333333335},{"$f":"'Data Update Form'!B370","v":0.40828402366863903},{"$f":"'Data Update Form'!E370","v":0.38106508875739648},{"$f":"'Data Update Form'!G370","v":1},"Dairy",{"$f":"'Data Update Form'!B273","v":27},{"$f":"'Data Update Form'!C273","v":14},{"$f":"'Data Update Form'!D273","v":24},{"$f":"'Data Update Form'!E273","v":10},{"$f":"'Data Update Form'!F273","v":3},{"$f":"'Data Update Form'!G273","v":5}]
[null,"Dairy Heifer",{"$f":"'Data Update Form'!B221","v":10.95},{"$f":"'Data Update Form'!C221","v":2536.1416666666669},{"$f":"'Data Update Form'!D221","v":110.71666666666667},{"$f":"'Data Update Form'!E221","v":37.716666666666669},{"$f":"'Data Update Form'!F221","v":112.54166666666669},{"$f":"'Data Update Form'!B370","v":0.40828402366863903},{"$f":"'Data Update Form'!E370","v":0.38106508875739648},{"$f":"'Data Update Form'!G370","v":1},"Dairy",{"$f":"'Data Update Form'!B272","v":32},{"$f":"'Data Update Form'!C272","v":14},{"$f":"'Data Update Form'!D272","v":28},{"$f":"'Data Update Form'!E272","v":10},{"$f":"'Data Update Form'!F272","v":3},{"$f":"'Data Update Form'!G272","v":7}]
[null,"Dairy Milk Cow",{"$f":"'Data Update Form'!B222","v":20.231428571428573},{"$f":"'Data Update Form'!C222","v":4875.8785714285714},{"$f":"'Data Update Form'!D222","v":263.06071428571431},{"$f":"'Data Update Form'!E222","v":135.31071428571431},{"$f":"'Data Update Form'!F222","v":147.30357142857142},{"$f":"'Data Update Form'!B368","v":0.75552825552825531},{"$f":"'Data Update Form'!E368","v":0.70515970515970505},{"$f":"'Data Update Form'!G368","v":1},"Dairy",{"$f":"'Data Update Form'!B270","v":31},{"$f":"'Data Update Form'!C270","v":15},{"$f":"'Data Update Form'!D270","v":19},{"$f":"'Data Update Form'!E270","v":10},{"$f":"'Data Update Form'!F270","v":3},{"$f":"'Data Update Form'!G270","v":6}]
[null,"Dairy Dry Cow",{"$f":"'Data Update Form'!B223","v":9.3008543417366951},{"$f":"'Data Update Form'!C223","v":2242.3064425770312},{"$f":"'Data Update Form'!D223","v":109.5},{"$f":"'Data Update Form'!E223","v":39.301400560224089},{"$f":"'Data Update Form'!F223","v":86.506022408963574},{"$f":"'Data Update Form'!B369","v":0.59866962305986704},{"$f":"'Data Update Form'!E369","v":0.55875831485587579},{"$f":"'Data Update Form'!G369","v":1},"Dairy",{"$f":"'Data Update Form'!B271","v":31},{"$f":"'Data Update Form'!C271","v":15},{"$f":"'Data Update Form'!D271","v":19},{"$f":"'Data Update Form'!E271","v":10},{"$f":"'Data Update Form'!F271","v":3},{"$f":"'Data Update Form'!G271","v":6}]
[null,"Swine - Nursery",{"$f":"'Data Update Form'!B225","v":13.778749999999999},{"$f":"'Data Update Form'!C225","v":3367.125},{"$f":"'Data Update Form'!D225","v":282.875},{"$f":"'Data Update Form'!E225","v":118.625},{"$f":"'Data Update Form'!F225","v":164.25},1,1,1,"Swine",{"$f":"'Data Update Form'!B275","v":25},{"$f":"'Data Update Form'!C275","v":19},{"$f":"'Data Update Form'!D275","v":22},{"$f":"'Data Update Form'!E275","v":13},{"$f":"'Data Update Form'!F275","v":8},{"$f":"'Data Update Form'!G275","v":4}]
[null,"Swine - Wean/Finish",{"$f":"'Data Update Form'!B226","v":9.9648601787101789},{"$f":"'Data Update Form'!C226","v":2411.4398562548563},{"$f":"'Data Update Form'!D226","v":225.35417637917641},{"$f":"'Data Update Form'!E226","v":84.566274281274289},{"$f":"'Data Update Form'!F226","v":116.06205905205906},1,1,1,"Swine",{"$f":"'Data Update Form'!B276","v":42},{"$f":"'Data Update Form'!C276","v":34},{"$f":"'Data Update Form'!D276","v":24},{"$f":"'Data Update Form'!E276","v":14},{"$f":"'Data Update Form'!F276","v":6},{"$f":"'Data Update Form'!G276","v":4}]
[null,"Swine- Wean/Finish (wet/dry feed)",{"$f":"'Data Update Form'!B227","v":9.9648601787101789},{"$f":"'Data Update Form'!C227","v":2411.4398562548563},{"$f":"'Data Update Form'!D227","v":225.35417637917641},{"$f":"'Data Update Form'!E227","v":84.566274281274289},{"$f":"'Data Update Form'!F227","v":116.06205905205906},1,1,1,"Swine",{"$f":"'Data Update Form'!B277","v":57},{"$f":"'Data Update Form'!C277","v":46},{"$f":"'Data Update Form'!D277","v":34},{"$f":"'Data Update Form'!E277","v":14},{"$f":"'Data Update Form'!F277","v":6},{"$f":"'Data Update Form'!G277","v":4}]
[null,"Swine - Grow/Finish",{"$f":"'Data Update Form'!B228","v":9.0113877233877222},{"$f":"'Data Update Form'!C228","v":2172.5185703185703},{"$f":"'Data Update Form'!D228","v":210.9739704739705},{"$f":"'Data Update Form'!E228","v":76.051592851592858},{"$f":"'Data Update Form'!F228","v":104.01507381507381},1,1,1,"Swine",{"$f":"'Data Update Form'!B278","v":58},{"$f":"'Data Update Form'!C278","v":44},{"$f":"'Data Update Form'!D278","v":40},{"$f":"'Data Update Form'!E278","v":16},{"$f":"'Data Update Form'!F278","v":9},{"$f":"'Data Update Form'!G278","v":5}]
[null,"Swine- Grow/Finish (wet/dry feed)",{"$f":"'Data Update Form'!B229","v":9.0113877233877222},{"$f":"'Data Update Form'!C229","v":2172.5185703185703},{"$f":"'Data Update Form'!D229","v":210.9739704739705},{"$f":"'Data Update Form'!E229","v":76.051592851592858},{"$f":"'Data Update Form'!F229","v":104.01507381507381},1,1,1,"Swine",{"$f":"'Data Update Form'!B279","v":75},{"$f":"'Data Update Form'!C279","v":54},{"$f":"'Data Update Form'!D279","v":40},{"$f":"'Data Update Form'!E279","v":22},{"$f":"'Data Update Form'!F279","v":22},{"$f":"'Data Update Form'!G279","v":17}]
[null,"Swine - Gestating Sow",{"$f":"'Data Update Form'!B230","v":4.1498472222222222},{"$f":"'Data Update Form'!C230","v":1000.5055555555556},{"$f":"'Data Update Form'!D230","v":57.994444444444447},{"$f":"'Data Update Form'!E230","v":36.5},{"$f":"'Data Update Form'!F230","v":46.030555555555544},1,1,1,"Swine",{"$f":"'Data Update Form'!B280","v":25},{"$f":"'Data Update Form'!C280","v":25},{"$f":"'Data Update Form'!D280","v":24},{"$f":"'Data Update Form'!E280","v":9},{"$f":"'Data Update Form'!F280","v":7},{"$f":"'Data Update Form'!G280","v":5}]
[null,"Swine - Lactating Sow",{"$f":"'Data Update Form'!B231","v":8.5349166666666676},{"$f":"'Data Update Form'!C231","v":2026.5611111111111},{"$f":"'Data Update Form'!D231","v":163.4388888888889},{"$f":"'Data Update Form'!E231","v":108.68888888888888},{"$f":"'Data Update Form'!F231","v":128.5611111111111},1,1,1,"Swine",{"$f":"'Data Update Form'!B281","v":15},{"$f":"'Data Update Form'!C281","v":12},{"$f":"'Data Update Form'!D281","v":11},{"$f":"'Data Update Form'!E281","v":14},{"$f":"'Data Update Form'!F281","v":6},{"$f":"'Data Update Form'!G281","v":4}]
[null,"Swine - Boar",{"$f":"'Data Update Form'!B232","v":3.7574722222222223},{"$f":"'Data Update Form'!C232","v":902.96944444444432},{"$f":"'Data Update Form'!D232","v":51.505555555555553},{"$f":"'Data Update Form'!E232","v":41.975000000000001},{"$f":"'Data Update Form'!F232","v":41.975000000000001},1,1,1,"Swine",{"$f":"'Data Update Form'!B282","v":25},{"$f":"'Data Update Form'!C282","v":25},{"$f":"'Data Update Form'!D282","v":24},{"$f":"'Data Update Form'!E282","v":9},{"$f":"'Data Update Form'!F282","v":7},{"$f":"'Data Update Form'!G282","v":5}]
[null,"Chickens - Layer",{"$f":"'Data Update Form'!B234","v":9.1249999999999982},{"$f":"'Data Update Form'!C234","v":2068.3333333333335},{"$f":"'Data Update Form'!D234","v":316.33333333333331},{"$f":"'Data Update Form'!E234","v":97.333333333333329},{"$f":"'Data Update Form'!F234","v":146},{"$f":"'Data Update Form'!B374","v":0.59389140271493213},{"$f":"'Data Update Form'!E374","v":0.55429864253393657},{"$f":"'Data Update Form'!G374","v":1},"Poultry",{"$f":"'Data Update Form'!B284","v":57},{"$f":"'Data Update Form'!C284","v":52},{"$f":"'Data Update Form'!D284","v":33},{"$f":"'Data Update Form'!E284","v":34},{"$f":"'Data Update Form'!F284","v":51},{"$f":"'Data Update Form'!G284","v":26}]
[null,"Chickens - Broiler",{"$f":"'Data Update Form'!B235","v":17.337499999999999},{"$f":"'Data Update Form'!C235","v":4197.5},{"$f":"'Data Update Form'!D235","v":383.25},{"$f":"'Data Update Form'!E235","v":255.49999999999997},{"$f":"'Data Update Form'!F235","v":182.5},{"$f":"'Data Update Form'!B375","v":0.41666666666666663},{"$f":"'Data Update Form'!E375","v":0.38888888888888884},{"$f":"'Data Update Form'!G375","v":1},"Poultry",{"$f":"'Data Update Form'!B285","v":63},{"$f":"'Data Update Form'!C285","v":40},{"$f":"'Data Update Form'!D285","v":29},{"$f":"'Data Update Form'!E285","v":46},{"$f":"'Data Update Form'!F285","v":53},{"$f":"'Data Update Form'!G285","v":36}]
[null,"Turkeys",{"$f":"'Data Update Form'!B236","v":7.6650000000000009},{"$f":"'Data Update Form'!C236","v":1824.9999999999998},{"$f":"'Data Update Form'!D236","v":243.63749999999999},{"$f":"'Data Update Form'!E236","v":160.60000000000002},{"$f":"'Data Update Form'!F236","v":105.85},{"$f":"'Data Update Form'!B376","v":0.47727272727272729},{"$f":"'Data Update Form'!E376","v":0.44545454545454538},{"$f":"'Data Update Form'!G376","v":0.46136363636363631},"Poultry",{"$f":"'Data Update Form'!B286","v":56},{"$f":"'Data Update Form'!C286","v":39},{"$f":"'Data Update Form'!D286","v":31},{"$f":"'Data Update Form'!E286","v":40},{"$f":"'Data Update Form'!F286","v":50},{"$f":"'Data Update Form'!G286","v":30}]
[null,"Horse",{"$f":"'Data Update Form'!B237","v":10.028375},{"$f":"'Data Update Form'!C237","v":2419.9499999999998},{"$f":"'Data Update Form'!D237","v":87.6},{"$f":"'Data Update Form'!E237","v":38.325000000000003},{"$f":"'Data Update Form'!F237","v":52.924999999999997},1,1,1,"Horse",{"$f":"'Data Update Form'!B287","v":0},{"$f":"'Data Update Form'!C287","v":0},{"$f":"'Data Update Form'!D287","v":0},{"$f":"'Data Update Form'!E287","v":14},{"$f":"'Data Update Form'!F287","v":4},{"$f":"'Data Update Form'!G287","v":14}]
[null,"Sheep",{"$f":"'Data Update Form'!B238","v":7.482499999999999},{"$f":"'Data Update Form'!C238","v":1825},{"$f":"'Data Update Form'!D238","v":146},{"$f":"'Data Update Form'!E238","v":73},{"$f":"'Data Update Form'!F238","v":146},1,1,1,"Sheep",{"$f":"'Data Update Form'!B288","v":0},{"$f":"'Data Update Form'!C288","v":0},{"$f":"'Data Update Form'!D288","v":0},{"$f":"'Data Update Form'!E288","v":18},{"$f":"'Data Update Form'!F288","v":11},{"$f":"'Data Update Form'!G288","v":26}]
[null,"Open Lot Runoff",null,null,null,null,null,1,1,1,"Other",{"$f":"'Data Update Form'!B289","v":4},{"$f":"'Data Update Form'!C289","v":1},{"$f":"'Data Update Form'!D289","v":4},{"$f":"'Data Update Form'!E289","v":0},{"$f":"'Data Update Form'!F289","v":0},{"$f":"'Data Update Form'!G289","v":0}]
[null,"Milkhouse Waste",null,null,null,null,null,1,1,1,"Other",{"$f":"'Data Update Form'!B290","v":1},{"$f":"'Data Update Form'!C290","v":0.5},{"$f":"'Data Update Form'!D290","v":1},{"$f":"'Data Update Form'!E290","v":0},{"$f":"'Data Update Form'!F290","v":0},{"$f":"'Data Update Form'!G290","v":0}]
[null,"Other Process Wastewater",null,null,null,null,null,1,1,1,"Other"]

{"sheet":"Data Update Form","index":1,"n_rows":477,"n_cols":50,"rows_kept":477,"cut":false,"hidden":true,"merged":[[474,12,474,13],[474,14,474,15],[475,12,475,13],[475,14,475,15],[476,12,476,13],[476,14,476,15],[466,0,467,0],[468,0,469,0],[470,0,470,7],[471,11,471,16],[473,12,473,13],[473,14,473,15],[464,0,465,0],[464,10,464,11],[464,14,464,15],[464,16,464,17],[465,10,465,11],[465,14,465,15],[465,16,465,17],[461,14,461,15],[461,16,461,17],[462,0,463,0],[462,10,462,11],[462,14,462,15],[462,16,462,17],[463,10,463,11],[463,14,463,15],[463,16,463,17],[458,0,459,0],[458,14,458,15],[458,16,458,17],[459,14,459,15],[459,16,459,17],[460,0,461,0],[460,10,460,11],[460,14,460,15],[460,16,460,17],[461,10,461,11],[447,0,447,1],[454,0,454,18],[456,2,456,7],[456,12,456,18],[457,14,457,15],[457,16,457,17],[441,0,441,1],[442,0,442,1],[443,0,443,1],[444,0,444,1],[445,0,445,1],[446,0,446,1],[426,0,427,0],[428,0,429,0],[430,0,431,0],[432,0,433,0],[436,2,436,9],[440,0,440,1],[410,0,411,0],[412,0,413,0],[418,0,418,18],[420,2,420,9],[422,0,423,0],[424,0,425,0],[408,0,409,0],[408,10,408,11],[408,14,408,15],[408,16,408,17],[409,10,409,11],[409,14,409,15],[409,16,409,17],[405,14,405,15],[405,16,405,17],[406,0,407,0],[406,10,406,11],[406,14,406,15],[406,16,406,17],[407,10,407,11],[407,14,407,15],[407,16,407,17],[402,0,403,0],[402,14,402,15],[402,16,402,17],[403,14,403,15],[403,16,403,17],[404,0,405,0],[404,10,404,11],[404,14,404,15],[404,16,404,17],[405,10,405,11],[390,0,391,0],[392,0,393,0],[398,0,398,18],[400,2,400,7],[400,12,400,18],[401,14,401,15],[401,16,401,17],[388,0,389,0],[388,10,388,11],[388,14,388,15],[388,16,388,17],[389,10,389,11],[389,14,389,15],[389,16,389,17],[386,0,387,0],[386,10,386,11],[386,14,386,15],[386,16,386,17],[387,10,387,11],[387,14,387,15],[387,16,387,17],[384,0,385,0],[384,10,384,11],[384,14,384,15],[384,16,384,17],[385,10,385,11],[385,14,385,15],[385,16,385,17],[380,2,380,7],[380,12,380,18],[381,14,381,15],[381,16,381,17],[382,0,383,0],[382,14,382,15],[382,16,382,17],[383,14,383,15],[383,16,383,17],[363,9,363,10],[363,11,363,12],[363,14,363,16],[363,17,363,18],[366,1,366,3],[378,0,378,18],[361,9,361,10],[361,11,361,12],[361,14,361,16],[361,17,361,18],[362,9,362,10],[362,11,362,12],[362,14,362,16],[362,17,362,18],[359,9,359,10],[359,11,359,12],[359,14,359,16],[359,17,359,18],[360,9,360,10],[360,11,360,12],[360,14,360,16],[360,17,360,18],[357,9,357,10],[357,11,357,12],[357,14,357,16],[357,17,357,18],[358,9,358,10],[358,11,358,12],[358,14,358,16],[358,17,358,18],[355,9,355,10],[355,11,355,12],[355,14,355,16],[355,17,355,18],[356,9,356,10],[356,11,356,12],[356,14,356,16],[356,17,356,18],[351,1,351,2],[352,0,352,5],[354,9,354,10],[354,11,354,12],[354,14,354,16],[354,17,354,18],[345,1,345,2],[346,1,346,2],[347,1,347,2],[348,1,348,2],[349,1,349,2],[350,1,350,2],[339,1,339,2],[340,1,340,2],[341,1,341,2],[342,1,342,2],[343,1,343,2],[344,1,344,2],[333,1,333,2],[334,1,334,2],[335,1,335,2],[336,1,336,2],[337,1,337,2],[338,1,338,2],[327,1,327,2],[328,1,328,2],[329,1,329,2],[330,1,330,2],[331,1,331,2],[332,1,332,2],[325,1,325,2],[325,10,325,11],[325,12,325,13],[325,14,325,18],[326,1,326,2],[326,10,326,11],[326,12,326,13],[326,14,326,18],[323,1,323,2],[323,10,323,11],[323,12,323,13],[323,14,323,18],[324,1,324,2],[324,10,324,11],[324,12,324,13],[324,14,324,18],[321,1,321,2],[321,10,321,11],[321,12,321,13],[321,14,321,18],[322,1,322,2],[322,10,322,11],[322,12,322,13],[322,14,322,18],[319,0,320,0],[319,1,320,2],[319,3,319,5],[319,10,319,11],[319,12,319,13],[319,14,319,18],[320,10,320,11],[320,12,320,13],[320,14,320,18],[260,4,260,6],[262,1,262,3],[262,4,262,6],[291,0,293,0],[291,1,291,3],[291,4,291,5],[293,1,293,5],[252,1,252,2],[253,1,253,2],[254,1,254,2],[255,1,255,2],[256,1,256,2],[260,0,262,0],[260,1,260,3],[247,1,247,2],[247,19,247,23],[248,1,248,2],[249,1,249,2],[250,1,250,2],[251,1,251,2],[236,10,236,11],[236,14,236,15],[236,16,236,17],[244,0,245,0],[244,1,245,2],[246,1,246,2],[234,10,234,11],[234,14,234,15],[234,16,234,17],[235,10,235,11],[235,14,235,15],[235,16,235,17],[220,10,220,11],[220,14,220,15],[220,16,220,17],[221,10,221,11],[221,14,221,15],[221,16,221,17],[218,10,218,11],[218,14,218,15],[218,16,218,17],[219,10,219,11],[219,14,219,15],[219,16,219,17],[216,10,216,11],[216,14,216,15],[216,16,216,17],[217,10,217,11],[217,14,217,15],[217,16,217,17],[213,14,213,15],[213,16,213,17],[214,10,214,11],[214,14,214,15],[214,16,214,17],[215,10,215,11],[215,14,215,15],[215,16,215,17],[210,0,212,0],[210,1,210,2],[210,3,210,5],[210,12,210,18],[211,14,211,15],[211,16,211,17],[212,14,212,15],[212,16,212,17],[200,0,201,0],[200,10,200,11],[200,14,200,15],[200,16,200,17],[202,0,203,0],[207,0,208,6],[208,10,208,18],[198,0,199,0],[198,10,198,11],[198,14,198,15],[198,16,198,17],[199,10,199,11],[199,14,199,15],[199,16,199,17],[196,0,197,0],[196,10,196,11],[196,14,196,15],[196,16,196,17],[197,10,197,11],[197,14,197,15],[197,16,197,17],[194,0,195,0],[194,10,194,11],[194,14,194,15],[194,16,194,17],[195,10,195,11],[195,14,195,15],[195,16,195,17],[188,0,188,18],[190,2,190,8],[190,12,190,18],[191,14,191,15],[191,16,191,17],[192,0,193,0],[192,14,192,15],[192,16,192,17],[193,14,193,15],[193,16,193,17],[180,0,181,0],[180,10,180,11],[180,14,180,15],[180,16,180,17],[182,0,183,0],[184,0,184,7],[178,0,179,0],[178,10,178,11],[178,14,178,15],[178,16,178,17],[179,10,179,11],[179,14,179,15],[179,16,179,17],[176,0,177,0],[176,10,176,11],[176,14,176,15],[176,16,176,17],[177,10,177,11],[177,14,177,15],[177,16,177,17],[174,0,175,0],[174,10,174,11],[174,14,174,15],[174,16,174,17],[175,10,175,11],[175,14,175,15],[175,16,175,17],[168,0,168,18],[170,2,170,8],[170,12,170,18],[171,14,171,15],[171,16,171,17],[172,0,173,0],[172,14,172,15],[172,16,172,17],[173,14,173,15],[173,16,173,17],[160,0,161,0],[160,10,160,11],[160,14,160,15],[160,16,160,17],[162,0,163,0],[164,0,164,7],[158,0,159,0],[158,10,158,11],[158,14,158,15],[158,16,158,17],[159,10,159,11],[159,14,159,15],[159,16,159,17],[156,0,157,0],[156,10,156,11],[156,14,156,15],[156,16,156,17],[157,10,157,11],[157,14,157,15],[157,16,157,17],[154,0,155,0],[154,10,154,11],[154,14,154,15],[154,16,154,17],[155,10,155,11],[155,14,155,15],[155,16,155,17],[148,0,148,18],[150,2,150,8],[150,12,150,18],[151,14,151,15],[151,16,151,17],[152,0,153,0],[152,14,152,15],[152,16,152,17],[153,14,153,15],[153,16,153,17],[140,0,141,0],[140,10,140,11],[140,14,140,15],[140,16,140,17],[142,0,143,0],[144,0,144,7],[138,0,139,0],[138,10,138,11],[138,14,138,15],[138,16,138,17],[139,10,139,11],[139,14,139,15],[139,16,139,17],[136,0,137,0],[136,10,136,11],[136,14,136,15],[136,16,136,17],[137,10,137,11],[137,14,137,15],[137,16,137,17],[134,0,135,0],[134,10,134,11],[134,14,134,15],[134,16,134,17],[135,10,135,11],[135,14,135,15],[135,16,135,17],[128,0,128,18],[130,2,130,8],[130,12,130,18],[131,14,131,15],[131,16,131,17],[132,0,133,0],[132,14,132,15],[132,16,132,17],[133,14,133,15],[133,16,133,17],[120,0,121,0],[120,10,120,11],[120,14,120,15],[120,16,120,17],[122,0,123,0],[124,0,124,7],[118,0,119,0],[118,10,118,11],[118,14,118,15],[118,16,118,17],[119,10,119,11],[119,14,119,15],[119,16,119,17],[116,0,117,0],[116,10,116,11],[116,14,116,15],[116,16,116,17],[117,10,117,11],[117,14,117,15],[117,16,117,17],[114,0,115,0],[114,10,114,11],[114,14,114,15],[114,16,114,17],[115,10,115,11],[115,14,115,15],[115,16,115,17],[108,0,108,18],[110,2,110,8],[110,12,110,18],[111,14,111,15],[111,16,111,17],[112,0,113,0],[112,14,112,15],[112,16,112,17],[113,14,113,15],[113,16,113,17],[100,0,101,0],[100,10,100,11],[100,14,100,15],[100,16,100,17],[102,0,103,0],[104,0,104,7],[98,0,99,0],[98,10,98,11],[98,14,98,15],[98,16,98,17],[99,10,99,11],[99,14,99,15],[99,16,99,17],[96,0,97,0],[96,10,96,11],[96,14,96,15],[96,16,96,17],[97,10,97,11],[97,14,97,15],[97,16,97,17],[94,0,95,0],[94,10,94,11],[94,14,94,15],[94,16,94,17],[95,10,95,11],[95,14,95,15],[95,16,95,17],[88,0,88,18],[90,2,90,8],[90,12,90,18],[91,14,91,15],[91,16,91,17],[92,0,93,0],[92,14,92,15],[92,16,92,17],[93,14,93,15],[93,16,93,17],[82,0,83,0],[84,0,84,7],[78,0,79,0],[78,10,78,11],[78,14,78,15],[78,16,78,17],[79,10,79,11],[79,14,79,15],[79,16,79,17],[76,0,77,0],[76,10,76,11],[76,14,76,15],[76,16,76,17],[77,10,77,11],[77,14,77,15],[77,16,77,17],[80,0,81,0],[80,10,80,11],[80,14,80,15],[80,16,80,17],[72,0,73,0],[72,14,72,15],[72,16,72,17],[73,14,73,15],[73,16,73,17],[74,0,75,0],[74,10,74,11],[74,14,74,15],[74,16,74,17],[75,10,75,11],[75,14,75,15],[75,16,75,17],[66,12,66,13],[66,14,66,15],[68,0,68,18],[70,2,70,8],[70,12,70,18],[71,14,71,15],[71,16,71,17],[63,9,64,11],[63,12,63,13],[63,14,63,15],[64,12,64,13],[64,14,64,15],[65,12,65,13],[65,14,65,15],[58,0,59,0],[58,10,58,11],[58,14,58,15],[58,16,58,17],[60,0,61,0],[62,0,62,7],[56,0,57,0],[56,10,56,11],[56,14,56,15],[56,16,56,17],[57,10,57,11],[57,14,57,15],[57,16,57,17],[49,14,49,15],[49,16,49,17],[50,0,51,0],[50,14,50,15],[50,16,50,17],[51,14,51,15],[51,16,51,17],[54,0,55,0],[54,10,54,11],[54,14,54,15],[54,16,54,17],[55,10,55,11],[55,14,55,15],[55,16,55,17],[52,0,53,0],[52,10,52,11],[52,14,52,15],[52,16,52,17],[53,10,53,11],[53,14,53,15],[53,16,53,17],[44,12,44,13],[44,14,44,15],[36,0,37,0],[36,10,36,11],[36,14,36,15],[46,0,46,18],[48,2,48,8],[48,12,48,18],[36,16,36,17],[38,0,39,0],[40,0,41,0],[41,9,42,11],[41,12,41,13],[41,14,41,15],[42,0,42,7],[42,12,42,13],[42,14,42,15],[34,0,35,0],[34,10,34,11],[34,14,34,15],[34,16,34,17],[35,10,35,11],[35,14,35,15],[35,16,35,17],[43,12,43,13],[43,14,43,15],[30,0,31,0],[30,14,30,15],[30,16,30,17],[31,14,31,15],[31,16,31,17],[32,0,33,0],[32,10,32,11],[32,14,32,15],[32,16,32,17],[33,10,33,11],[33,14,33,15],[33,16,33,17],[21,12,21,13],[21,14,21,15],[26,0,26,18],[28,2,28,7],[28,12,28,18],[29,14,29,15],[29,16,29,17],[18,9,19,11],[18,12,18,13],[18,14,18,15],[19,12,19,13],[19,14,19,15],[20,12,20,13],[20,14,20,15],[16,0,17,0],[16,30,16,31],[16,32,16,33],[16,35,17,35],[17,30,17,31],[17,32,17,33],[14,0,15,0],[14,30,14,31],[14,32,14,33],[14,35,15,35],[15,30,15,31],[15,32,15,33],[10,0,11,0],[10,10,10,11],[10,14,10,15],[10,16,10,17],[10,23,10,24],[10,25,10,26],[13,14,13,15],[13,16,13,17],[13,23,13,24],[13,25,13,26],[12,0,13,0],[12,10,12,11],[12,14,12,15],[12,16,12,17],[12,23,12,24],[12,25,12,26],[6,25,6,26],[6,27,6,28],[12,30,13,32],[12,35,13,35],[13,10,13,11],[8,27,8,28],[8,35,9,35],[9,10,9,11],[9,14,9,15],[9,16,9,17],[9,23,9,24],[9,25,9,26],[9,27,9,28],[10,27,10,28],[10,35,11,35],[11,10,11,11],[11,14,11,15],[11,16,11,17],[11,23,11,24],[11,25,11,26],[11,27,11,28],[13,27,13,28],[12,27,12,28],[8,0,9,0],[8,10,8,11],[8,14,8,15],[8,16,8,17],[8,23,8,24],[8,25,8,26],[2,0,2,18],[6,0,7,0],[2,30,2,53],[4,2,4,7],[4,12,4,18],[4,42,4,47],[5,14,5,15],[5,16,5,17],[5,21,5,28],[6,35,7,35],[7,14,7,15],[7,16,7,17],[7,23,7,24],[7,25,7,26],[7,27,7,28],[6,14,6,15],[6,16,6,17],[6,23,6,24]]}
["Fertilizer Recommendations for Agronomic Crops in MN  (BU-06240-S Revised 2001)",null,null,null,null,null,null,null,"= not used in calc's",null,"P Rec's use soil test values (except sugar beets)",null,null,null,null,null,"changed 2017 to align with 2016 revisions to corn rec's - changed all crops to Alfalfa stand age nomenclature instead of good, fair, poor"]
[]
["CORN - CORN - CORN - CORN - CORN - CORN - CORN - CORN - CORN - CORN - CORN - CORN - CORN - CORN - CORN - CORN - CORN - CORN",null,null,null,null,null,null,null,null,null,null,null,null,null,null,null,null,null,null,null,null,null,null,null,null,null,null,null,null,null,"CORN on IRRIGATED SAND Adjustments (2015)"]
[null,"Nitrogen Recommendations",null,null,null,"new rec's",null,null,null,null,"Phosphorus Recommendations (Broadcast)",null,null,null,null,null,null,null,null,null,"Potassium Recommendations (Broadcast)",null,null,null,null,null,null,null,null,null,null,null,null,null,null,null,"Nitrogen Recommendations",null,null,null,null,null,null,null,null,"new rec's"]
[null,null,"Expected Yield (bu/BAre)",null,null,null,null,null,null,null,null,null,"Soil Test P (ppm)",null,null,null,null,null,null,null,null,null,null,null,null,null,null,null,null,null,235,"= used in 2015",null,null,null,null,null,null,null,null,null,null,"Expected Yield (bu/BAre)"]
["Crop Grown Last Year","Organic Matter Level","<100","100-124","125-149","150-174","175-199","200+",null,null,null,null,"Very Low","Low","Medium",null,"High",null,"Very High",null,null,"Soil Test K (ppm)",null,null,null,null,null,null,null,null,null,"MRTN","low","high",null,"Crop Grown Last Year","Organic Matter Level",null,null,null,null,null,"<100","100-124","125-149","150-174","175-199","200+"]
["Alfalfa 2+ year old stand","low",0,0,40,40,40,40,null,"good","Expected","Bray:","0-5","6-10","11-15",null,"16-20",null,"21+",null,null,"Very Low","Low","Medium",null,"High",null,"Very High",null,null,0.05,235,210,255,null,"Alfalfa 2+ year old stand","low",null,null,null,null,null,{"$f":"$AV$18-$AW$8","v":150},150,150,150,150,{"$f":"$AV$18-$AW$8","v":150},null,"good"]
[null,"med/high",0,0,40,40,40,40,{"$f":"$H$18-H8","v":155},null,"Yield","Olsen:","0-3","4-7","8-11",null,"12-15",null,"16+",null,"Yield","0-40","41-80","81-120",null,"121-160",null,"161+",null,null,0.1,210,190,225,null,null,"med/high",null,null,null,null,null,150,150,150,150,150,{"$f":"$AV$18-$AW$8","v":150},85]
["Alfalfa 1 year old stand","low",30,30,80,80,80,80,null,"fair","<100",null,60,40,25,null,10,null,0,null,"<100",100,{"$f":"#REF!","v":{"$error":"#REF!"}},{"$f":"#REF!","v":{"$error":"#REF!"}},null,{"$f":"#REF!","v":{"$error":"#REF!"}},null,{"$f":"#REF!","v":{"$error":"#REF!"}},null,null,0.15,190,175,210,null,"Alfalfa 1 year old stand","low",null,null,null,null,null,{"$f":"$AV$18-$AW$10","v":170},170,170,170,170,{"$f":"$AV$18-$AW$10","v":170},null,"fair"]
[null,"med/high",30,30,80,80,80,80,{"$f":"$H$18-H10","v":115},null,"100-124",null,75,50,30,null,10,null,0,null,"100-124",120,{"$f":"#REF!","v":{"$error":"#REF!"}},{"$f":"#REF!","v":{"$error":"#REF!"}},null,{"$f":"#REF!","v":{"$error":"#REF!"}},null,{"$f":"#REF!","v":{"$error":"#REF!"}},null,null,0.2,180,165,190,null,null,"med/high",null,null,null,null,null,170,170,170,170,170,{"$f":"$AV$18-$AW$10","v":170},65]
["Soybeans","low",100,100,150,150,150,150,null,"poor","125-149",null,85,60,35,null,10,null,0,null,"125-149",145,{"$f":"#REF!","v":{"$error":"#REF!"}},{"$f":"#REF!","v":{"$error":"#REF!"}},null,{"$f":"#REF!","v":{"$error":"#REF!"}},null,{"$f":"#REF!","v":{"$error":"#REF!"}},null,null,null,null,null,null,null,"Soybeans","low",null,null,null,null,null,{"$f":"$AV$18-$AW$12","v":205},205,205,205,205,{"$f":"$AV$18-$AW$12","v":205},null,"poor"]
[null,"med/high",100,100,150,150,150,150,{"$f":"$H$18-H12","v":45},null,"150-174",null,100,70,40,null,15,null,0,null,"150-174",165,{"$f":"#REF!","v":{"$error":"#REF!"}},{"$f":"#REF!","v":{"$error":"#REF!"}},null,{"$f":"#REF!","v":{"$error":"#REF!"}},null,{"$f":"#REF!","v":{"$error":"#REF!"}},null,null,null,null,null,null,null,null,"med/high",null,null,null,null,null,205,205,205,205,205,{"$f":"$AV$18-$AW$12","v":205},30]
["Edible beans, field peas","low",125,125,175,175,175,175,null,null,"175-199",null,110,75,45,null,15,null,0,null,"175-199",185,{"$f":"#REF!","v":{"$error":"#REF!"}},{"$f":"#REF!","v":{"$error":"#REF!"}},null,{"$f":"#REF!","v":{"$error":"#REF!"}},null,{"$f":"#REF!","v":{"$error":"#REF!"}},null,null,"Second Year Legume Credit",null,null,null,null,"Edible beans, field peas","low",null,null,null,null,null,{"$f":"$AV$18-$AW$14","v":215},215,215,215,215,{"$f":"$AV$18-$AW$14","v":215}]
[null,"med/high",125,125,175,175,175,175,{"$f":"$H$18-H14","v":20},null,"200+",null,120,85,50,null,15,null,0,null,"200+",205,{"$f":"#REF!","v":{"$error":"#REF!"}},{"$f":"#REF!","v":{"$error":"#REF!"}},null,{"$f":"#REF!","v":{"$error":"#REF!"}},null,{"$f":"#REF!","v":{"$error":"#REF!"}},null,null,null,null,null,null,null,null,"med/high",null,null,null,null,null,215,215,215,215,215,{"$f":"$AV$18-$AW$14","v":215},20]
["Group 1 Crops: Clover, fallow, grass/legume hay, grass/leg, pasture, etc.","low",70,70,120,120,120,120,null,null,null,null,null,null,null,null,null,null,null,null,"Calculated Potassium Recommendations (Used if test value is entered)",null,null,null,null,null,null,null,null,null,"Legume Crop",null,"Credit",null,null,"Group 1 Crops: Clover, fallow, grass/legume hay, grass/leg, pasture, etc.","low",null,null,null,null,null,{"$f":"$AV$18-$AW$16","v":160},160,160,160,160,{"$f":"$AV$18-$AW$16","v":160}]
[null,"med/high",70,70,120,120,120,120,{"$f":"$H$18-H16","v":75},null,null,null,null,null,null,null,null,null,null,null,"K20 = [W - (X)*(K ppm)]*(Expected Yield)",null,null,null,"W =",null,"X=",null,null,null,"Alfalfa 2+ year old stand",null,85,null,null,null,"med/high",null,null,null,null,null,160,160,160,160,160,{"$f":"$AV$18-$AW$16","v":160},75]
["Group 2 Crops: Corn, wheat, oats, potatoes, sugar beets, grass, rye, etc.","low",145,145,195,195,195,195,null,null,null,null,null,null,null,null,null,null,null,null,null,null,null,null,null,null,null,null,null,null,"Alfalfa 1 year old stand",null,65,null,null,"Group 2 Crops: Corn, wheat, oats, potatoes, sugar beets, grass, rye, etc.","low",null,null,null,null,null,{"$f":"$AV$18","v":235},235,235,235,{"$f":"$AV$18","v":235},{"$f":"$AV$18","v":235}]
[null,"med/high",145,145,195,195,195,195,null,null,null,null,null,null,null,null,null,null,null,null,null,null,null,null,null,null,null,null,null,null,"Red Clover",null,35,null,null,null,"med/high",null,null,null,null,null,235,235,235,235,{"$f":"$AV$18","v":235},{"$f":"$AE$5","v":235}]
[null,null,null,null,null,null,null,null,null,"Second Year Legume Credit",null,null,"Legume Crop",null,"Credit"]
["Calculated Phosphorus Recommendations (Used if test value is entered)",null,null,null,null,null,null,null,null,null,null,null,"Alfalfa 2+ year old stand",null,115]
["P2O5 = [W - (X)*(Bray P ppm)]*(Expected Yield)",null,null,null,"W=",0.7,"X=",3.5000000000000003E-2,null,null,null,null,"Alfalfa 1 year old stand",null,75]
["P2O5 = [Y - (Z)*(Olsen P ppm)]*(Expected Yield)",null,null,null,"Y=",0.7,"Z=",4.3999999999999997E-2,null,null,null,null,"Red Clover",null,35]
[]
["Calculated Potassium Recommendations (Used if test value is entered)"]
["K20 = [A - (B)*(K ppm)]*(Expected Yield)",null,null,null,"A=",1.1659999999999999,"B=",7.3000000000000001E-3]
[]
["Wheat - Wheat - Wheat - Wheat - Wheat - Wheat - Wheat - Wheat - Wheat - Wheat - Wheat - Wheat - Wheat - Wheat - Wheat - Wheat - Wheat"]
[null,"Nitrogen Recommendations",null,null,null,null,null,null,null,null,"Phosphorus Recommendations (Broadcast)"]
[null,null,"Expected Yield (bu/BAre)",null,null,null,null,null,null,null,null,null,"Soil Test P (ppm)"]
["Crop Grown Last Year","Organic Matter Level","40-49","50-59","60-69","70-79","80+",null,null,null,null,null,"Very Low","Low","Medium",null,"High",null,"Very High"]
["Alfalfa 2+ year old stand","low",0,30,55,80,95,null,"Alfalfa - good",null,"Expected","Bray:","0-5","6-10","11-15",null,"16-20",null,"21+"]
[null,"med/high",0,0,35,60,75,null,null,null,"Yield","Olsen:","0-3","4-7","8-11",null,"12-15",null,"16+"]
["Alfalfa 1 year old stand","low",30,55,80,105,120,null,"Alfalfa- fair",null,{"$f":"C30","v":"40-49"},null,40,30,15,null,0,null,0]
[null,"med/high",0,35,60,85,100,null,null,null,{"$f":"D30","v":"50-59"},null,50,35,20,null,0,null,0]
["Soybeans","low",60,85,110,135,150,null,null,null,{"$f":"E30","v":"60-69"},null,60,45,20,null,0,null,0]
[null,"med/high",40,65,90,115,130,null,null,null,{"$f":"F30","v":"70-79"},null,70,50,25,null,0,null,0]
["Edible beans, field peas","low",70,95,120,145,160,null,null,null,{"$f":"G30","v":"80+"},null,80,55,25,null,0,null,0]
[null,"med/high",50,75,100,125,140,null,null,null,"Calculated Phosphorus Recommendations (Used if test value is entered)"]
["Group 1 Crops: Clover, fallow, grass/legume hay, grass/leg, pasture, etc.","low",30,55,80,105,120,null,null,null,"P2O5 = [W - (X)*(Bray P ppm)]*(Expected Yield)",null,null,null,"W=",1.071,"X=",5.3999999999999999E-2]
[null,"med/high",0,35,60,85,100,null,null,null,"P2O5 = [Y - (Z)*(Olsen P ppm)]*(Expected Yield)",null,null,null,"Y=",1.071,"Z=",6.7000000000000004E-2]
["Group 2 Crops: Corn, wheat, oats, potatoes, sugar beets, grass, rye, etc.","low",80,105,130,155,170,null,"Alfalfa - poor"]
[null,"med/high",60,85,110,135,150,null,null,"Second Year Legume Credit",null,null,"Legume Crop",null,"Credit"]
["Alfalfa good = 2+, Fair = 1 yr, poor considered group 2",null,null,null,null,null,null,null,null,null,null,null,"Alfalfa 2+ year old stand",null,35]
["Calculated Potassium Recommendations (Used if test value is entered)",null,null,null,null,null,null,null,null,null,null,null,"Alfalfa 1 year old stand & birdsfoot trefoil",null,25]
["K2O = [A - (B)*(K ppm)]*(Expected Yield)",null,null,null,"A=",2.71,"B=",1.7000000000000001E-2,null,null,null,null,"Red Clover",null,20]
[]
["Barley - Barley - Barley - Barley - Barley - Barley - Barley - Barley - Barley - Barley - Barley - Barley - Barley - Barley - Barley - Barley - Barley"]
[null,"Nitrogen Recommendations",null,null,null,null,null,null,null,null,"Phosphorus Recommendations (Broadcast)"]
[null,null,"Expected Yield (bu/BAre)",null,null,null,null,null,null,null,null,null,"Soil Test P (ppm)"]
["Crop Grown Last Year","Organic Matter Level","0-50","50-59","60-69","70-79","80-89","90-99","100+",null,null,null,"Very Low","Low","Medium",null,"High",null,"Very High"]
["Alfalfa 2+ year old stand","low",0,0,15,30,45,60,75,"Good & Fair","Expected","Bray:","0-5","6-10","11-15",null,"16-20",null,"21+"]
[null,"med/high",0,0,0,10,25,40,55,null,"Yield","Olsen:","0-3","4-7","8-11",null,"12-15",null,"16+"]
["Alfalfa 1 year old stand","low",30,50,65,80,95,110,125,"Poor",{"$f":"C50","v":"0-50"},null,35,25,15,null,0,null,0]
[null,"med/high",0,30,45,60,75,90,105,null,{"$f":"D50","v":"50-59"},null,40,25,15,null,0,null,0]
["Soybeans","low",30,50,65,80,95,110,125,null,{"$f":"E50","v":"60-69"},null,45,30,20,null,0,null,0]
[null,"med/high",0,30,45,60,75,90,105,null,{"$f":"F50","v":"70-79"},null,50,35,20,null,0,null,0]
["Edible beans, field peas","low",40,60,75,90,105,120,135,null,{"$f":"G50","v":"80-89"},null,60,40,25,null,0,null,0]
[null,"med/high",0,40,55,70,85,100,115,null,{"$f":"H50","v":"90-99"},null,65,45,25,null,0,null,0]
["Group 1 Crops: Clover, fallow, grass/legume hay, grass/leg, pasture, etc.","low",0,20,35,50,65,80,95,null,{"$f":"I50","v":"100+"},null,70,50,0,null,0,null,0]
[null,"med/high",0,0,15,30,45,60,75,null,"Calculated Phosphorus Recommendations (Used if test value is entered)"]
["Group 2 Crops: Corn, wheat, oats, potatoes, sugar beets, grass, rye, etc.","low",50,70,85,100,115,130,145,null,"P2O5 = [W - (X)*(Bray P ppm)]*(Expected Yield)",null,null,null,"W=",0.78500000000000003,"X=",3.9E-2]
[null,"med/high",30,50,65,80,95,110,125,null,"P2O5 = [Y - (Z)*(Olsen P ppm)]*(Expected Yield)",null,null,null,"Y=",0.78500000000000003,"Z=",0.05]
["Alfalfa good and Fair combined, poor seperated from soybeans"]
["Calculated Potassium Recommendations (Used if test value is entered)",null,null,null,null,null,null,null,null,"Second Year Legume Credit",null,null,"Legume Crop",null,"Credit"]
["K2O = [A - (B)*(K ppm)]*(Expected Yield)",null,null,null,"A=",1.286,"B=",8.5000000000000006E-3,null,null,null,null,"Alfalfa 2+ year old stand",null,35,null,"Alfalfa -good"]
[null,null,null,null,null,null,null,null,null,null,null,null,"Alfalfa 1 year old stand",null,20,null,"alfalfa fair & poor combined 20 lb credit used to not short N"]
[null,null,null,null,null,null,null,null,null,null,null,null,"Red Clover & birdsfoot trefoil",null,20]
[]
["Oats - Oats - Oats - Oats - Oats - Oats - Oats - Oats - Oats - Oats - Oats - Oats - Oats - Oats - Oats - Oats - Oats - Oats - Oats - Oats - Oats - Oats"]
[null,"Nitrogen Recommendations",null,null,null,null,null,null,null,null,"Phosphorus Recommendations (Broadcast)"]
[null,null,"Expected Yield (bu/BAre)",null,null,null,null,null,null,null,null,null,"Soil Test P (ppm)"]
["Crop Grown Last Year","Organic Matter Level","40-60","61-80","81-100","101-120","121+",null,null,null,null,null,"Very Low","Low","Medium",null,"High",null,"Very High"]
["Alfalfa 2+ year old stand","low",0,0,0,0,0,null,null,"good","Expected","Bray:","0-5","6-10","11-15",null,"16-20",null,"21+"]
[null,"med/high",0,0,0,0,0,null,null,null,"Yield","Olsen:","0-3","4-7","8-11",null,"12-15",null,"16+"]
["Alfalfa 1 year old stand","low",0,20,40,60,80,null,null,"fair and poor",{"$f":"C72","v":"40-60"},null,30,20,10,null,0,null,0]
[null,"med/high",0,0,30,50,70,null,null,null,{"$f":"D72","v":"61-80"},null,40,30,15,null,0,null,0]
["Soybeans","low",0,20,40,60,80,null,null,null,{"$f":"E72","v":"81-100"},null,50,35,20,null,0,null,0]
[null,"med/high",0,0,30,50,70,null,null,null,{"$f":"F72","v":"101-120"},null,60,45,25,null,10,null,0]
["Edible beans, field peas","low",20,40,60,80,100,null,null,null,{"$f":"G72","v":"121+"},null,70,50,30,null,10,null,0]
[null,"med/high",10,30,50,70,90]
["Group 1 Crops: Clover, fallow, grass/legume hay, grass/leg, pasture, etc.","low",0,0,0,25,45]
[null,"med/high",0,0,0,15,35,null,null,null,"Calculated Phosphorus Recommendations (Used if test value is entered)"]
["Group 2 Crops: Corn, wheat, oats, potatoes, sugar beets, grass, rye, etc.","low",40,60,80,100,120,null,null,null,"P2O5 = [W - (X)*(Bray P ppm)]*(Expected Yield)",null,null,null,"W=",0.64400000000000002,"X=",3.2000000000000001E-2]
[null,"med/high",30,50,70,90,110,null,null,null,"P2O5 = [Y - (Z)*(Olsen P ppm)]*(Expected Yield)",null,null,null,"Y=",0.64400000000000002,"Z=",4.1000000000000002E-2]
["Alfalfa Poor and Fair combined, poor seperated from soybeans"]
["Calculated Potassium Recommendations (Used if test value is entered)"]
["K2O = [A - (B)*(K ppm)]*(Expected Yield)",null,null,null,"A=",1.2769999999999999,"B=",8.6E-3]
[]
["Buckwheat - Buckwheat - Buckwheat - Buckwheat - Buckwheat - Buckwheat - Buckwheat - Buckwheat - Buckwheat - Buckwheat - Buckwheat"]
[null,"Nitrogen Recommendations",null,null,null,null,null,null,null,null,"Phosphorus Recommendations (Broadcast)"]
[null,null,"Expected Yield (lb/BAre)",null,null,null,null,null,null,null,null,null,"Soil Test P (ppm)"]
["Crop Grown Last Year","Organic Matter Level","1200-1450","1451-1700","1701-1950","1951-2200",null,null,null,null,null,null,"Very Low","Low","Medium",null,"High",null,"Very High"]
["Alfalfa 2+ year old stand","low",0,0,0,0,null,null,null,"good","Expected","Bray:","0-5","6-10","11-15",null,"16-20",null,"21+"]
[null,"med/high",0,0,0,0,null,null,null,null,"Yield","Olsen:","0-3","4-7","8-11",null,"12-15",null,"16+"]
["Alfalfa 1 year old stand","low",0,10,20,30,null,null,null,"fair & poor",{"$f":"C92","v":"1200-1450"},null,35,20,15,null,0,null,0]
[null,"med/high",0,0,0,0,null,null,null,null,{"$f":"D92","v":"1451-1700"},null,40,25,15,null,0,null,0]
["Soybeans","low",0,10,20,30,null,null,null,null,{"$f":"E92","v":"1701-1950"},null,45,30,20,null,0,null,0]
[null,"med/high",0,0,0,0,null,null,null,null,{"$f":"F92","v":"1951-2200"},null,50,35,20,null,0,null,0]
["Edible beans, field peas","low",20,30,40,50]
[null,"med/high",0,10,20,30]
["Group 1 Crops: Clover, fallow, grass/legume hay, grass/leg, pasture, etc.","low",0,0,0,0]
[null,"med/high",0,0,0,0,null,null,null,null,"Calculated Phosphorus Recommendations (Used if test value is entered)"]
["Group 2 Crops: Corn, wheat, oats, potatoes, sugar beets, grass, rye, etc.","low",40,50,60,70,null,null,null,null,"P2O5 = [W - (X)*(Bray P ppm)]*(Expected Yield)",null,null,null,"W=",2.75E-2,"X=",1.4E-3]
[null,"med/high",20,30,40,50,null,null,null,null,"P2O5 = [Y - (Z)*(Olsen P ppm)]*(Expected Yield)",null,null,null,"Y=",2.75E-2,"Z=",1.6999999999999999E-3]
["Alfalfa Poor and Fair combined, poor seperated from soybeans"]
["Calculated Potassium Recommendations (Used if test value is entered)"]
["K2O = [A - (B)*(K ppm)]*(Expected Yield)",null,null,null,"A=",3.5799999999999998E-2,"B=",2.3E-2]
[]
["Canola - Canola - Canola - Canola - Canola - Canola - Canola - Canola - Canola - Canola - Canola - Canola - Canola - Canola - Canola - Canola"]
[null,"Nitrogen Recommendations",null,null,null,null,null,null,null,null,"Phosphorus Recommendations (Broadcast)"]
[null,null,"Expected Yield (cwt/BAre)",null,null,null,null,null,null,null,null,null,"Soil Test P (ppm)"]
["Crop Grown Last Year","Organic Matter Level","10-15","16-20","21-25","25+",null,null,null,null,null,null,"Very Low","Low","Medium",null,"High",null,"Very High"]
["Alfalfa 2+ year old stand","low",0,0,0,0,null,null,null,"Good & fair","Expected","Bray:","0-5","6-10","11-15",null,"16-20",null,"21+"]
[null,"med/high",0,0,0,0,null,null,null,null,"Yield","Olsen:","0-3","4-7","8-11",null,"12-15",null,"16+"]
["Alfalfa 1 year old stand","low",0,10,20,30,null,null,null,"poor",{"$f":"C112","v":"10-15"},null,40,25,15,null,0,null,0]
[null,"med/high",0,0,0,0,null,null,null,null,{"$f":"D112","v":"16-20"},null,55,40,25,null,0,null,0]
["Soybeans","low",0,10,20,30,null,null,null,null,{"$f":"E112","v":"21-25"},null,75,50,30,null,10,null,0]
[null,"med/high",0,0,0,0,null,null,null,null,{"$f":"F112","v":"25+"},null,80,55,35,null,10,null,0]
["Edible beans, field peas","low",20,30,40,50,null,null,null,"not in rec's - used those for buckwheat"]
[null,"med/high",0,10,20,30]
["Group 1 Crops: Clover, fallow, grass/legume hay, grass/leg, pasture, etc.","low",0,0,0,0]
[null,"med/high",0,0,0,0,null,null,null,null,"Calculated Phosphorus Recommendations (Used if test value is entered)"]
["Group 2 Crops: Corn, wheat, oats, potatoes, sugar beets, grass, rye, etc.","low",40,50,60,70,null,null,null,null,"P2O5 = [W - (X)*(Bray P ppm)]*(Expected Yield)",null,null,null,"W=",3.6,"X=",0.17]
[null,"med/high",20,30,40,50,null,null,null,null,"P2O5 = [Y - (Z)*(Olsen P ppm)]*(Expected Yield)",null,null,null,"Y=",3.6,"Z=",0.22]
["Alfalfa good and Fair combined, poor seperated from soybeans"]
["Calculated Potassium Recommendations (Used if test value is entered)"]
["K2O = [A - (B)*(K ppm)]*(Expected Yield)",null,null,null,"A=",5.4,"B=",3.4000000000000002E-2]
[]
["Edible Beans - Edible Beans - Edible Beans - Edible Beans - Edible Beans - Edible Beans - Edible Beans - Edible Beans - Edible Beans"]
[null,"Nitrogen Recommendations",null,null,null,null,null,null,null,null,"Phosphorus Recommendations (Broadcast)"]
[null,null,"Expected Yield (lb/BAre)",null,null,null,null,null,null,null,null,null,"Soil Test P (ppm)"]
["Crop Grown Last Year","Organic Matter Level","1401-1900","1901-2400","2401-2900","2901+",null,null,null,null,null,null,"Very Low","Low","Medium",null,"High",null,"Very High"]
["Alfalfa 2+ year old stand","low",0,0,0,0,null,null,null,"good","Expected","Bray:","0-5","6-10","11-15",null,"16-20",null,"21+"]
[null,"med/high",0,0,0,0,null,null,null,null,"Yield","Olsen:","0-3","4-7","8-11",null,"12-15",null,"16+"]
["Alfalfa 1 year old stand","low",0,20,40,60,null,null,null,"fair and poor",{"$f":"C132","v":"1401-1900"},null,35,25,15,null,0,null,0]
[null,"med/high",0,0,10,30,null,null,null,null,{"$f":"D132","v":"1901-2400"},null,45,30,20,null,10,null,0]
["Soybeans","low",60,80,100,120,null,null,null,"Not considered a previous crop",{"$f":"E132","v":"2401-2900"},null,55,40,25,null,10,null,0]
[null,"med/high",30,50,70,90,null,null,null,"used group 2 rec's",{"$f":"F132","v":"2901+"},null,60,45,25,null,10,null,0]
["Edible beans, field peas","low",60,80,100,120,null,null,null,"Not considered a previous crop"]
[null,"med/high",30,50,70,90,null,null,null,"used group 2 rec's"]
["Group 1 Crops: Clover, fallow, grass/legume hay, grass/leg, pasture, etc.","low",0,0,25,45]
[null,"med/high",0,0,0,25,null,null,null,null,"Calculated Phosphorus Recommendations (Used if test value is entered)"]
["Group 2 Crops: Corn, wheat, oats, potatoes, sugar beets, grass, rye, etc.","low",60,80,100,120,null,null,null,null,"P2O5 = [W - (X)*(Bray P ppm)]*(Expected Yield)",null,null,null,"W=",2.3099999999999999E-2,"X=",1.1000000000000001E-3]
[null,"med/high",30,50,70,90,null,null,null,null,"P2O5 = [Y - (Z)*(Olsen P ppm)]*(Expected Yield)",null,null,null,"Y=",2.3099999999999999E-2,"Z=",1.4E-3]
["Alfalfa Poor and Fair combined, poor seperated from soybeans"]
["Calculated Potassium Recommendations (Used if test value is entered)"]
["K2O = [A - (B)*(K ppm)]*(Expected Yield)",null,null,null,"A=",3.4599999999999999E-2,"B=",2.0999999999999999E-3]
[]
["Millet - Millet - Millet - Millet - Millet - Millet - Millet - Millet - Millet - Millet - Millet - Millet - Millet - Millet - Millet - Millet - Millet - Millet - Millet"]
[null,"Nitrogen Recommendations",null,null,null,null,null,null,null,null,"Phosphorus Recommendations (Broadcast)"]
[null,null,"Expected Yield (lb/BAre)",null,null,null,null,null,null,null,null,null,"Soil Test P (ppm)"]
["Crop Grown Last Year","Organic Matter Level","1500-1900","1901-2300","2301-2700","2701-3000","3100+",null,null,null,null,null,"Very Low","Low","Medium",null,"High",null,"Very High"]
["Alfalfa 2+ year old stand","low",0,0,0,0,0,null,null,"good","Expected","Bray:","0-5","6-10","11-15",null,"16-20",null,"21+"]
[null,"med/high",0,0,0,0,0,null,null,null,"Yield","Olsen:","0-3","4-7","8-11",null,"12-15",null,"16+"]
["Alfalfa 1 year old stand","low",0,10,20,40,60,null,null,"fair and ppor",{"$f":"C152","v":"1500-1900"},null,25,20,10,null,0,null,0]
[null,"med/high",0,0,0,20,40,null,null,null,{"$f":"D152","v":"1901-2300"},null,30,25,15,null,0,null,0]
["Soybeans","low",0,10,20,40,60,null,null,null,{"$f":"E152","v":"2301-2700"},null,40,25,15,null,0,null,0]
[null,"med/high",0,0,0,20,40,null,null,null,{"$f":"F152","v":"2701-3000"},null,45,30,20,null,0,null,0]
["Edible beans, field peas","low",20,30,40,60,80,null,null,null,{"$f":"G152","v":"3100+"},null,45,35,20,null,0,null,0]
[null,"med/high",0,10,20,40,60]
["Group 1 Crops: Clover, fallow, grass/legume hay, grass/leg, pasture, etc.","low",0,0,0,0,25]
[null,"med/high",0,0,0,0,0,null,null,null,"Calculated Phosphorus Recommendations (Used if test value is entered)"]
["Group 2 Crops: Corn, wheat, oats, potatoes, sugar beets, grass, rye, etc.","low",40,50,60,80,100,null,null,null,"P2O5 = [W - (X)*(Bray P ppm)]*(Expected Yield)",null,null,null,"W=",1.7100000000000001E-2,"X=",8.5000000000000006E-3]
[null,"med/high",20,30,40,60,80,null,null,null,"P2O5 = [Y - (Z)*(Olsen P ppm)]*(Expected Yield)",null,null,null,"Y=",1.7100000000000001E-2,"Z=",1.14E-3]
["Alfalfa Poor and Fair combined, poor seperated from soybeans"]
["Calculated Potassium Recommendations (Used if test value is entered)"]
["K2O = [A - (B)*(K ppm)]*(Expected Yield)",null,null,null,"A=",0.03,"B=",1.8000000000000001E-4]
[]
["Rye - Rye - Rye - Rye - Rye - Rye - Rye - Rye - Rye - Rye - Rye - Rye - Rye - Rye - Rye - Rye - Rye - Rye - Rye - Rye - Rye - Rye - Rye - Rye - Rye"]
[null,"Nitrogen Recommendations",null,null,null,null,null,null,null,null,"Phosphorus Recommendations (Broadcast)"]
[null,null,"Expected Yield (bu/BAre)",null,null,null,null,null,null,null,null,null,"Soil Test P (ppm)"]
["Crop Grown Last Year","Organic Matter Level","40-49","50-59","60-69","70-79","80+",null,null,null,null,null,"Very Low","Low","Medium",null,"High",null,"Very High"]
["Alfalfa 2+ year old stand","low",0,0,40,65,95,null,null,"good and fair","Expected","Bray:","0-5","6-10","11-15",null,"16-20",null,"21+"]
[null,"med/high",0,0,20,45,75,null,null,null,"Yield","Olsen:","0-3","4-7","8-11",null,"12-15",null,"16+"]
["Alfalfa 1 year old stand","low",40,65,90,115,140,null,null,"poor",{"$f":"C172","v":"40-49"},null,40,30,15,null,0,null,0]
[null,"med/high",20,45,70,95,120,null,null,null,{"$f":"D172","v":"50-59"},null,50,35,20,null,0,null,0]
["Soybeans","low",40,65,90,115,140,null,null,null,{"$f":"E172","v":"60-69"},null,60,45,20,null,0,null,0]
[null,"med/high",20,45,70,95,120,null,null,null,{"$f":"F172","v":"70-79"},null,70,50,25,null,0,null,0]
["Edible beans, field peas","low",50,75,100,125,150,null,null,null,{"$f":"G172","v":"80+"},null,80,55,25,null,0,null,0]
[null,"med/high",30,55,80,105,130]
["Group 1 Crops: Clover, fallow, grass/legume hay, grass/leg, pasture, etc.","low",0,35,60,85,110]
[null,"med/high",0,0,40,65,90,null,null,null,"Calculated Phosphorus Recommendations (Used if test value is entered)"]
["Group 2 Crops: Corn, wheat, oats, potatoes, sugar beets, grass, rye, etc.","low",60,85,110,135,160,null,null,null,"P2O5 = [W - (X)*(Bray P ppm)]*(Expected Yield)",null,null,null,"W=",1.071,"X=",5.3999999999999999E-2]
[null,"med/high",40,65,90,115,140,null,null,null,"P2O5 = [Y - (Z)*(Olsen P ppm)]*(Expected Yield)",null,null,null,"Y=",1.071,"Z=",6.7000000000000004E-2]
["Alfalfa good and Fair combined, poor seperated from soybeans"]
["Calculated Potassium Recommendations (Used if test value is entered)"]
["K2O = [A - (B)*(K ppm)]*(Expected Yield)",null,null,null,"A=",2.71,"B=",0.17]
[]
["Sunflowers - Sunflowers - Sunflowers - Sunflowers - Sunflowers - Sunflowers - Sunflowers - Sunflowers - Sunflowers - Sunflowers - Sunflowers"]
[null,"Nitrogen Recommendations",null,null,null,null,null,null,null,null,"Phosphorus Recommendations (Broadcast)"]
[null,null,"Expected Yield (lb/BAre)",null,null,null,null,null,null,null,null,null,"Soil Test P (ppm)"]
["Crop Grown Last Year","Organic Matter Level","1400-1900","1901-2400","2401-2900","2901-3300","3300+",null,null,null,null,null,"Very Low","Low","Medium",null,"High",null,"Very High"]
["Alfalfa 2+ year old stand","low",0,0,0,0,0,null,null,"good","Expected","Bray:","0-5","6-10","11-15",null,"16-20",null,"21+"]
[null,"med/high",0,0,0,0,0,null,null,null,"Yield","Olsen:","0-3","4-7","8-11",null,"12-15",null,"16+"]
["Alfalfa 1 year old stand","low",30,50,70,90,110,null,null,"fair and poor",{"$f":"C192","v":"1400-1900"},null,55,35,15,null,0,null,0]
[null,"med/high",0,20,40,60,80,null,null,"30 lb difference is the most as a result of changing nomenclature",{"$f":"D192","v":"1901-2400"},null,65,45,20,null,0,null,0]
["Soybeans","low",30,50,70,90,110,null,null,null,{"$f":"E192","v":"2401-2900"},null,75,55,25,null,0,null,0]
[null,"med/high",0,20,40,60,80,null,null,null,{"$f":"F192","v":"2901-3300"},null,85,65,25,null,10,null,0]
["Edible beans, field peas","low",null,null,null,null,null,null,null,null,{"$f":"G192","v":"3300+"},null,90,70,30,null,10,null,0]
[null,"med/high"]
["Group 1 Crops: Clover, fallow, grass/legume hay, grass/leg, pasture, etc.","low",0,15,25,45,65]
[null,"med/high",0,0,0,25,45,null,null,null,"Calculated Phosphorus Recommendations (Used if test value is entered)"]
["Group 2 Crops: Corn, wheat, oats, potatoes, sugar beets, grass, rye, etc.","low",70,90,110,130,150,null,null,null,"P2O5 = [W - (X)*(Bray P ppm)]*(Expected Yield)",null,null,null,"W=",2.2499999999999999E-2,"X=",1.1000000000000001E-3]
[null,"med/high",40,60,80,100,120,null,null,null,"P2O5 = [Y - (Z)*(Olsen P ppm)]*(Expected Yield)",null,null,null,"Y=",2.2499999999999999E-2,"Z=",1.4E-3]
["Calculated Potassium Recommendations (Used if test value is entered)"]
["K2O = [A - (B)*(K ppm)]*(Expected Yield)",null,null,null,"A=",4.1000000000000002E-2,"B=",2.7E-4]
[]
["Tables in Orange will not affect calculations in the spreadsheet although some will affect the tables A-D displayed so they need to be updated regardless"]
[null,null,null,null,null,null,null,null,null,null,"Alfalfa - Alfalfa - Alfalfa - Alfalfa - Alfalfa - Alfalfa - Alfalfa - Alfalfa",null,null,null,null,null,null,null,null,null,null,null,null,null,null,null,null,null,null,null,"MWPS 2004 Table 6 - Excretion values"]
["Table A1.  Annual manure production and nutrient excretion from livestock",null,null,null,null,null,"Table is updated via chart to right",null,null,null,"Phosphorus Recommendations (Broadcast)",null,null,null,null,null,null,null,null,null,null,null,null,null,null,null,null,null,null,null,null,"Daily",null,null,null,null,null,null,null,null,null,null,"Yearly/1000 lbs of animal"]
["Animal Type","Manure Production per 1,000 lbs. of Animal Weight",null,"Excreted Nutrients in Manure per 1,000 lbs. of Animal Weight",null,null,null,null,null,null,null,null,"Soil Test P (ppm)",null,null,null,null,null,null,null,null,null,null,null,null,null,null,null,null,null,null,null,"lbs","gal","N","P","K","lbs manure/lb of animal","gal manure/lb of animal","n/lb","P/lb","K/lb","lb","gal","N","P","K","ton"]
[null,"Solid","Liquid","N","P2O5","K20",null,null,null,null,null,null,"Very Low","Low","Medium",null,"High",null,"Very High",null,null,null,null,null,null,null,null,null,null,"Dairy","Calf",150,12,1.38,0.06,0.01,0.05,{"$f":"AG212/$AF212","v":0.08},{"$f":"AH212/$AF212","v":9.1999999999999998E-3},{"$f":"AI212/$AF212","v":3.9999999999999996E-4},{"$f":"AJ212/$AF212","v":6.666666666666667E-5},{"$f":"AK212/$AF212","v":3.3333333333333338E-4},{"$f":"AL212*1000*365","v":29200},{"$f":"AM212*1000*365","v":3357.9999999999995},146,24.333333333333332,121.66666666666669,{"$f":"AQ212/2000","v":14.6}]
[null,"(tons/year)","(gallons/year)","(lbs per year)","(lbs per year)","(lbs per year)",null,null,null,null,"Expected","Bray:","0-5","6-10","11-15",null,"16-20",null,"21+",null,null,null,null,null,null,null,null,null,null,null,null,250,20,2.2999999999999998,0.11,0.02,0.09,{"$f":"AG213/$AF213","v":0.08},9.1999999999999998E-3,4.4000000000000002E-4,8.0000000000000007E-5,3.5999999999999997E-4,{"$f":"AL213*1000*365","v":29200},3357.9999999999995,160.6,29.2,131.4,{"$f":"AQ213/2000","v":14.6}]
["Beef cattle",null,null,null,null,null,null,null,null,null,"Yield","Olsen:","0-3","4-7","8-11",null,"12-15",null,"16+",null,null,null,null,null,null,null,null,null,null,null,"Heifer",750,45,5.21,0.23,0.08,0.23,0.06,6.946666666666667E-3,3.0666666666666668E-4,1.0666666666666667E-4,3.0666666666666668E-4,21900,2535.5333333333338,111.93333333333335,38.93333333333333,111.93333333333335,10.95]
["Beef Calf",{"$f":"AVERAGE(AV222:AV223)","v":19.419871794871796},{"$f":"AVERAGE(AR222:AR223)","v":4592.136752136752},{"$f":"AVERAGE(AS222:AS223)","v":162.53418803418805},{"$f":"AVERAGE(AT222:AT223)","v":73},{"$f":"AVERAGE(AU222:AU223)","v":129.46581196581195},null,null,null,null,"<1",null,45,35,20,null,10,null,0,null,null,null,null,null,null,null,null,null,null,null,null,1000,60,6.95,0.3,0.1,0.31,0.06,6.9500000000000004E-3,2.9999999999999997E-4,1E-4,3.1E-4,21900,2536.75,109.5,36.5,113.15,10.95]
["Beef Feeder (High forage diet)",{"$f":"AVERAGE(AV224:AV225)","v":8.9812121212121205},{"$f":"AVERAGE(AR224:AR225)","v":2142.439393939394},{"$f":"AVERAGE(AS224:AS225)","v":132.06363636363636},{"$f":"AVERAGE(AT224:AT225)","v":39.375757575757575},{"$f":"AVERAGE(AU224:AU225)","v":82.843939393939394},null,null,null,null,"1-2",null,45,35,20,null,10,null,0,null,null,null,null,null,null,null,null,null,null,null,"LBAtating cow",1000,111,13.36,0.72,0.37,0.4,0.111,1.3359999999999999E-2,7.1999999999999994E-4,3.6999999999999999E-4,4.0000000000000002E-4,40515,4876.3999999999996,262.8,135.05000000000001,146,20.2575]
["Beef Feeder (High energy diet)",{"$f":"AVERAGE(AV224:AV225)","v":8.9812121212121205},{"$f":"AVERAGE(AR224:AR225)","v":2142.439393939394},{"$f":"AVERAGE(AS224:AS225)","v":132.06363636363636},{"$f":"AVERAGE(AT224:AT225)","v":39.375757575757575},{"$f":"AVERAGE(AU224:AU225)","v":82.843939393939394},null,null,null,null,"2-3",null,45,35,20,null,10,null,0,null,null,null,null,null,null,null,null,null,null,null,null,1400,155,18.7,1.01,0.52,0.56999999999999995,0.11071428571428571,1.3357142857142857E-2,7.2142857142857143E-4,3.7142857142857143E-4,4.0714285714285711E-4,40410.714285714283,4875.3571428571431,263.32142857142856,135.57142857142858,148.60714285714283,20.205357142857142]
["Beef Cow",{"$f":"AV226","v":16.79},{"$f":"AR226","v":3982.15},{"$f":"AS226","v":127.74999999999999},{"$f":"AT226","v":65.7},{"$f":"AU226","v":105.85},null,null,null,null,"3-4",null,65,45,25,null,10,null,0,null,null,null,null,null,null,null,null,null,null,null,"Dry Cow",1000,51,6.14,0.3,0.11,0.24,5.0999999999999997E-2,6.1399999999999996E-3,2.9999999999999997E-4,1.1E-4,2.3999999999999998E-4,18615,2241.1,109.5,40.15,87.6,9.3074999999999992]
["Dairy cattle",null,null,null,null,null,null,null,null,null,"4-5",null,80,55,30,null,15,null,0,null,null,null,null,null,null,null,null,null,null,null,null,1400,71,8.6,0.42,0.15,0.33,5.0714285714285712E-2,6.1428571428571426E-3,2.9999999999999997E-4,1.0714285714285714E-4,2.3571428571428571E-4,18510.714285714283,2242.1428571428569,109.5,39.107142857142854,86.035714285714278,9.2553571428571413]
["Dairy Calf",{"$f":"AVERAGE(AV212:AV213)","v":14.6},{"$f":"AVERAGE(AR212:AR213)","v":3357.9999999999995},{"$f":"AVERAGE(AS212:AS213)","v":153.30000000000001},{"$f":"AVERAGE(AT212:AT213)","v":26.766666666666666},{"$f":"AVERAGE(AU212:AU213)","v":126.53333333333335},null,null,null,null,"5-6",null,95,65,40,null,15,null,0,null,null,null,null,null,null,null,null,null,null,null,null,1700,87,10.45,0.51,0.18,0.4,5.1176470588235295E-2,6.1470588235294117E-3,3.0000000000000003E-4,1.0588235294117646E-4,2.3529411764705883E-4,18679.411764705885,2243.6764705882356,109.50000000000001,38.647058823529406,85.882352941176464,9.3397058823529431]
["Dairy Heifer",{"$f":"AVERAGE(AV214:AV215)","v":10.95},{"$f":"AVERAGE(AR214:AR215)","v":2536.1416666666669},{"$f":"AVERAGE(AS214:AS215)","v":110.71666666666667},{"$f":"AVERAGE(AT214:AT215)","v":37.716666666666669},{"$f":"AVERAGE(AU214:AU215)","v":112.54166666666669},null,null,null,null,"6-7",null,110,80,45,null,20,null,0,null,null,null,null,null,null,null,null,null,null,null,"Veal",250,6.6,0.79,0.03,0.02,0.05,2.64E-2,3.16E-3,1.1999999999999999E-4,8.0000000000000007E-5,2.0000000000000001E-4,9636,1153.4000000000001,43.8,29.2,73,4.8179999999999996]
["Dairy Milk Cow",{"$f":"AVERAGE(AV216:AV217)","v":20.231428571428573},{"$f":"AVERAGE(AR216:AR217)","v":4875.8785714285714},{"$f":"AVERAGE(AS216:AS217)","v":263.06071428571431},{"$f":"AVERAGE(AT216:AT217)","v":135.31071428571431},{"$f":"AVERAGE(AU216:AU217)","v":147.30357142857142},null,null,null,null,"7+",null,125,90,55,null,25,null,0,null,null,null,null,null,null,null,null,null,null,"Beef","Calf",450,48,5.66,0.2,0.09,0.16,0.10666666666666667,1.2577777777777778E-2,4.4444444444444447E-4,1.9999999999999998E-4,3.5555555555555557E-4,38933.333333333336,4590.8888888888887,162.22222222222223,73,129.77777777777777,19.466666666666669]
["Dairy Dry Cow",{"$f":"AVERAGE(AV218:AV220)","v":9.3008543417366951},{"$f":"AVERAGE(AR218:AR220)","v":2242.3064425770312},{"$f":"AVERAGE(AS218:AS220)","v":109.5},{"$f":"AVERAGE(AT218:AT220)","v":39.301400560224089},{"$f":"AVERAGE(AU218:AU220)","v":86.506022408963574},null,null,null,null,"Calculated Phosphorus Recommendations (Used if test value is entered)",null,null,null,null,null,null,null,null,null,null,null,null,null,null,null,null,null,null,null,null,650,69,8.18,0.28999999999999998,0.13,0.23,0.10615384615384615,1.2584615384615383E-2,4.4615384615384612E-4,2.0000000000000001E-4,3.5384615384615386E-4,38746.153846153851,4593.3846153846143,162.84615384615384,73,129.15384615384616,19.373076923076926]
["Swine",null,null,null,null,null,null,null,null,null,"P2O5 = [W - (X)*(Bray P ppm)]*(Expected Yield)",null,null,null,"W=",18.57,"X=",0.93,null,null,null,null,null,null,null,null,null,null,null,null,"Finishing",750,37,4.4000000000000004,0.27,0.08,0.17,4.9333333333333333E-2,5.8666666666666667E-3,3.6000000000000002E-4,1.0666666666666667E-4,2.2666666666666668E-4,18006.666666666668,2141.3333333333335,131.4,38.93333333333333,82.733333333333334,9.0033333333333339]
["Swine - Nursery",{"$f":"AVERAGE(AV227:AV228)","v":13.778749999999999},{"$f":"AVERAGE(AR227:AR228)","v":3367.125},{"$f":"AVERAGE(AS227:AS228)","v":282.875},{"$f":"AVERAGE(AT227:AT228)","v":118.625},{"$f":"AVERAGE(AU227:AU228)","v":164.25},null,null,null,null,"P2O5 = [Y - (Z)*(Olsen P ppm)]*(Expected Yield)",null,null,null,"Y=",18.57,"Z=",1.1599999999999999,null,null,null,null,null,null,null,null,null,null,null,null,null,1100,54,6.46,0.4,0.12,0.25,4.9090909090909088E-2,5.8727272727272725E-3,3.6363636363636367E-4,1.0909090909090909E-4,2.2727272727272727E-4,17918.181818181816,2143.5454545454545,132.72727272727272,39.818181818181813,82.954545454545453,8.9590909090909072]
["Swine - Wean/Finish",{"$f":"(0.2*B225+0.8*B228)","v":9.9648601787101789},{"$f":"(0.2*C225+0.8*C228)","v":2411.4398562548563},{"$f":"(0.2*D225+0.8*D228)","v":225.35417637917641},{"$f":"(0.2*E225+0.8*E228)","v":84.566274281274289},{"$f":"(0.2*F225+0.8*F228)","v":116.06205905205906},"20% nursery & 80% finish",null,null,null,"Calculated Potassium Recommendations (Used if test value is entered)",null,null,null,null,null,null,null,null,null,null,null,null,null,null,null,null,null,null,null,"Cow",1000,92,10.91,0.35,0.18,0.28999999999999998,9.1999999999999998E-2,1.091E-2,3.5E-4,1.7999999999999998E-4,2.9E-4,33580,3982.15,127.74999999999999,65.7,105.85,16.79]
["Swine - Wean/Finish (wet/dry feed)",{"$f":"(0.2*B225+0.8*B229)","v":9.9648601787101789},{"$f":"(0.2*C225+0.8*C229)","v":2411.4398562548563},{"$f":"(0.2*D225+0.8*D229)","v":225.35417637917641},{"$f":"(0.2*E225+0.8*E229)","v":84.566274281274289},{"$f":"(0.2*F225+0.8*F229)","v":116.06205905205906},"20% nursery & 80% finish",null,null,null,"K2O = [A - (B)*(K ppm)]*(Expected Yield)",null,null,null,"A=",55.7,"B=",0.38,null,null,null,null,null,null,null,null,null,null,null,"Swine","Nursery",25,1.9,0.23,0.02,0.01,0.01,7.5999999999999998E-2,9.1999999999999998E-3,8.0000000000000004E-4,4.0000000000000002E-4,4.0000000000000002E-4,27740,3357.9999999999995,292,146,146,13.87]
["Swine - Grow/Finish",{"$f":"AVERAGE(AV229:AV233)","v":9.0113877233877222},{"$f":"AVERAGE(AR229:AR233)","v":2172.5185703185703},{"$f":"AVERAGE(AS229:AS233)","v":210.9739704739705},{"$f":"AVERAGE(AT229:AT233)","v":76.051592851592858},{"$f":"AVERAGE(AU229:AU233)","v":104.01507381507381},null,null,null,null,null,null,null,null,null,null,null,null,null,null,null,null,null,null,null,null,null,null,null,null,null,40,3,0.37,0.03,0.01,0.02,7.4999999999999997E-2,9.2499999999999995E-3,7.5000000000000002E-4,2.5000000000000001E-4,5.0000000000000001E-4,27375,3376.25,273.75,91.25,182.5,13.6875]
["Swine - Grow/Finish (wet/dry feed)",{"$f":"AVERAGE(AV229:AV233)","v":9.0113877233877222},{"$f":"AVERAGE(AR229:AR233)","v":2172.5185703185703},{"$f":"AVERAGE(AS229:AS233)","v":210.9739704739705},{"$f":"AVERAGE(AT229:AT233)","v":76.051592851592858},{"$f":"AVERAGE(AU229:AU233)","v":104.01507381507381},null,null,null,null,"Grass/Hay - Grass/Hay - Grass/Hay - Grass/Hay - Grass/Hay",null,null,null,null,null,null,null,null,null,null,null,null,null,null,null,null,null,null,null,"Finshing",150,7.4,0.89,0.09,0.03,0.04,4.9333333333333333E-2,5.933333333333333E-3,5.9999999999999995E-4,1.9999999999999998E-4,2.6666666666666668E-4,18006.666666666668,2165.6666666666665,219,73,97.333333333333329,9.0033333333333339]
["Swine - Gestating Sow",{"$f":"AVERAGE(AV234:AV236)","v":4.1498472222222222},{"$f":"AVERAGE(AR234:AR236)","v":1000.5055555555556},{"$f":"AVERAGE(AS234:AS236)","v":57.994444444444447},{"$f":"AVERAGE(AT234:AT236)","v":36.5},{"$f":"AVERAGE(AU234:AU236)","v":46.030555555555544},null,null,null,null,"Phosphorus Recommendations (Broadcast)",null,null,null,null,null,null,null,null,null,null,null,null,null,null,null,null,null,null,null,null,180,8.9,1.07,0.1,0.04,0.05,4.9444444444444444E-2,5.9444444444444449E-3,5.5555555555555556E-4,2.2222222222222223E-4,2.7777777777777778E-4,18047.222222222223,2169.7222222222222,202.7777777777778,81.111111111111114,101.3888888888889,9.0236111111111121]
["Swine - LBAtating Sow",{"$f":"AVERAGE(AV237:AV239)","v":8.5349166666666676},{"$f":"AVERAGE(AR237:AR239)","v":2026.5611111111111},{"$f":"AVERAGE(AS237:AS239)","v":163.4388888888889},{"$f":"AVERAGE(AT237:AT239)","v":108.68888888888888},{"$f":"AVERAGE(AU237:AU239)","v":128.5611111111111},null,null,null,null,null,null,"Soil Test P (ppm)",null,null,null,null,null,null,null,null,null,null,null,null,null,null,null,null,null,null,220,10.9,1.31,0.13,0.05,0.06,4.9545454545454545E-2,5.9545454545454546E-3,5.9090909090909094E-4,2.2727272727272727E-4,2.7272727272727274E-4,18084.090909090908,2173.4090909090905,215.68181818181819,82.954545454545453,99.545454545454561,9.0420454545454536]
["Swine - Boar",{"$f":"AVERAGE(AV240:AV242)","v":3.7574722222222223},{"$f":"AVERAGE(AR240:AR242)","v":902.96944444444432},{"$f":"AVERAGE(AS240:AS242)","v":51.505555555555553},{"$f":"AVERAGE(AT240:AT242)","v":41.975000000000001},{"$f":"AVERAGE(AU240:AU242)","v":41.975000000000001},null,null,null,null,null,null,"Very Low","Low","Medium",null,"High",null,"Very High",null,null,null,null,null,null,null,null,null,null,null,null,260,12.8,1.55,0.15,0.05,0.08,4.9230769230769231E-2,5.9615384615384617E-3,5.7692307692307687E-4,1.9230769230769231E-4,3.076923076923077E-4,17969.23076923077,2175.9615384615386,210.57692307692307,70.192307692307693,112.30769230769232,8.9846153846153847]
["Poultry",null,null,null,null,null,null,null,null,null,"Expected","Bray:","0-5","6-10","11-15",null,"16-20",null,"21+",null,null,null,null,null,null,null,null,null,null,null,null,300,14.8,1.79,0.17,0.06,0.09,4.9333333333333333E-2,5.966666666666667E-3,5.6666666666666671E-4,1.9999999999999998E-4,2.9999999999999997E-4,18006.666666666668,2177.8333333333335,206.83333333333331,73,109.5,9.0033333333333339]
["Chickens - Layer",{"$f":"AVERAGE(AV244)","v":9.1249999999999982},{"$f":"AVERAGE(AR244)","v":2068.3333333333335},{"$f":"AVERAGE(AS244)","v":316.33333333333331},{"$f":"AVERAGE(AT244)","v":97.333333333333329},{"$f":"AVERAGE(AU244)","v":146},null,null,null,null,"Yield","Olsen:","0-3","4-7","8-11",null,"12-15",null,"16+",null,null,null,null,null,null,null,null,null,null,null,"Gestating",300,6.8,0.82,0.05,0.03,0.04,2.2666666666666665E-2,2.7333333333333333E-3,1.6666666666666669E-4,9.9999999999999991E-5,1.3333333333333334E-4,8273.3333333333321,997.66666666666674,60.833333333333343,36.5,48.666666666666664,4.1366666666666658]
["Chickens - Broiler",{"$f":"AVERAGE(AV243)","v":17.337499999999999},{"$f":"AVERAGE(AR243)","v":4197.5},{"$f":"AVERAGE(AS243)","v":383.25},{"$f":"AVERAGE(AT243)","v":255.49999999999997},{"$f":"AVERAGE(AU243)","v":182.5},null,null,null,null,"<2",null,40,30,20,null,10,null,0,null,null,null,null,null,null,null,null,null,null,null,null,400,9.1,1.1000000000000001,0.06,0.04,0.05,2.2749999999999999E-2,2.7500000000000003E-3,1.4999999999999999E-4,1E-4,1.25E-4,8303.75,1003.7500000000001,54.75,36.5,45.625,4.1518750000000004]
["Turkeys",{"$f":"AVERAGE(AV245:AV246)","v":7.6650000000000009},{"$f":"AVERAGE(AR245:AR246)","v":1824.9999999999998},{"$f":"AVERAGE(AS245:AS246)","v":243.63749999999999},{"$f":"AVERAGE(AT245:AT246)","v":160.60000000000002},{"$f":"AVERAGE(AU245:AU246)","v":105.85},null,null,null,null,"2-3",null,50,40,30,null,20,null,0,null,null,null,null,null,null,null,null,null,null,null,null,500,11.4,1.37,0.08,0.05,0.06,2.2800000000000001E-2,2.7400000000000002E-3,1.6000000000000001E-4,1E-4,1.1999999999999999E-4,8322,1000.1,58.4,36.5,43.8,4.1609999999999996]
["Horse",{"$f":"AVERAGE(AV249:AV250)","v":10.028375},{"$f":"AVERAGE(AR249:AR250)","v":2419.9499999999998},{"$f":"AVERAGE(AS249:AS250)","v":87.6},{"$f":"AVERAGE(AT249:AT250)","v":38.325000000000003},{"$f":"AVERAGE(AU249:AU250)","v":52.924999999999997},null,null,null,null,"3-4",null,60,50,40,null,30,null,0,null,null,null,null,null,null,null,null,null,null,null,"LBAtating",375,17.5,2.08,0.17,0.11,0.13,4.6666666666666669E-2,5.5466666666666668E-3,4.5333333333333337E-4,2.9333333333333333E-4,3.4666666666666667E-4,17033.333333333336,2024.5333333333333,165.46666666666667,107.06666666666666,126.53333333333333,8.5166666666666675]
["Sheep",{"$f":"AV248","v":7.482499999999999},{"$f":"AR248","v":1825},{"$f":"AS248","v":146},{"$f":"AT248","v":73},{"$f":"AU248","v":146},null,null,null,null,"4+",null,70,60,50,null,40,null,0,null,null,null,null,null,null,null,null,null,null,null,null,500,23.4,2.78,0.22,0.15,0.18,4.6799999999999994E-2,5.5599999999999998E-3,4.4000000000000002E-4,2.9999999999999997E-4,3.5999999999999997E-4,17082,2029.3999999999999,160.6,109.5,131.4,8.5410000000000004]
["1.  Deep-pit system with nipple waters.",null,null,null,null,null,null,null,null,null,"Calculated Phosphorus Recommendations (Used if test value is entered)",null,null,null,null,null,null,null,null,null,null,null,null,null,null,null,null,null,null,null,null,600,28.1,3.33,0.27,0.18,0.21,4.6833333333333338E-2,5.5500000000000002E-3,4.5000000000000004E-4,2.9999999999999997E-4,3.5E-4,17094.166666666668,2025.75,164.25000000000003,109.5,127.74999999999999,8.5470833333333331]
["2.  Dry feeders used in conjunction with cup or swinging waters have similar results as wet/dry feeders.",null,null,null,null,null,null,null,null,null,"P2O5 = [W - (X)*(Bray P ppm)]*(Expected Yield)",null,null,null,"W=",19.12,"X=",0.73199999999999998,null,null,null,null,null,null,null,null,null,null,null,null,"Boar",300,6.2,0.74,0.04,0.03,0.03,2.0666666666666667E-2,2.4666666666666665E-3,1.3333333333333334E-4,9.9999999999999991E-5,9.9999999999999991E-5,7543.3333333333339,900.33333333333326,48.666666666666664,36.5,36.5,3.7716666666666669]
[null,null,null,null,null,null,null,null,null,null,"P2O5 = [Y - (Z)*(Olsen P ppm)]*(Expected Yield)",null,null,null,"Y=",19.12,"Z=",1.012,null,null,null,null,null,null,null,null,null,null,null,null,null,400,8.1999999999999993,0.99,0.06,0.05,0.05,2.0499999999999997E-2,2.4749999999999998E-3,1.4999999999999999E-4,1.25E-4,1.25E-4,7482.4999999999991,903.37499999999989,54.75,45.625,45.625,3.7412499999999995]
[null,null,null,null,null,null,null,null,null,null,"Calculated Potassium Recommendations (Used if test value is entered)",null,null,null,null,null,null,null,null,null,null,null,null,null,null,null,null,null,null,null,null,500,10.3,1.24,7.0000000000000007E-2,0.06,0.06,2.06E-2,2.48E-3,1.4000000000000001E-4,1.1999999999999999E-4,1.1999999999999999E-4,7519.0000000000009,905.2,51.1,43.8,43.8,3.7595000000000005]
[null,null,null,null,null,null,null,null,null,null,"K2O = [A - (B)*(K ppm)]*(Expected Yield)",null,null,null,"A=",40.43,"B=",0.28599999999999998,null,null,null,null,null,null,null,null,null,null,null,"Poultry","Broiler",2,0.19,2.3E-2,2.0999999999999999E-3,1.4E-3,1E-3,9.5000000000000001E-2,1.15E-2,1.0499999999999999E-3,6.9999999999999999E-4,5.0000000000000001E-4,34675,4197.5,383.25,255.49999999999997,182.5,17.337499999999999]
["Table A2.  Nitrogen losses from animal manure as affected by method of handling and storage.",null,null,null,null,null,null,null,null,null,null,null,null,null,null,null,null,null,null,null,null,null,null,null,null,null,null,null,null,null,"Layer",3,0.15,1.7000000000000001E-2,2.5999999999999999E-3,8.0000000000000004E-4,1.1999999999999999E-3,4.9999999999999996E-2,5.6666666666666671E-3,8.6666666666666663E-4,2.6666666666666668E-4,3.9999999999999996E-4,18249.999999999996,2068.3333333333335,316.33333333333331,97.333333333333329,146,9.1249999999999982]
["Manure Storage and Handling Method","Manure Type",null,"Storage Nitrogen Loss",null,null,null,null,null,null,"Sugar Beets - Sugar Beets - Sugar Beets - Sugar Beets",null,null,null,null,null,null,null,null,null,null,null,null,null,null,null,null,null,null,null,"Turkey (hen)",10,0.47,5.6000000000000001E-2,7.7999999999999996E-3,5.1000000000000004E-3,3.3999999999999998E-3,4.7E-2,5.5999999999999999E-3,7.7999999999999999E-4,5.1000000000000004E-4,3.3999999999999997E-4,17155,2043.9999999999998,284.7,186.15,124.1,8.5775000000000006]
[null,null,null,"%",null,null,null,null,null,null,"Phosphorus Recommendations (Broadcast)",null,null,null,null,null,null,null,null,null,null,null,null,null,null,null,null,null,null,null,"Turkey (tom)",20,0.74,8.7999999999999995E-2,1.11E-2,7.4000000000000003E-3,4.7999999999999996E-3,3.6999999999999998E-2,4.3999999999999994E-3,5.5500000000000005E-4,3.6999999999999999E-4,2.3999999999999998E-4,13505,1605.9999999999998,202.57500000000002,135.05000000000001,87.6,6.7525000000000004]
["Daily scrape and haul","Solid (tons)",null,25,null,null,null,null,null,null,null,null,"Soil Test P (ppm)",null,null,null,null,null,null,null,null,null,null,null,null,null,null,null,null,null,"Duck",4,0.44,5.2999999999999999E-2,4.3E-3,3.3999999999999998E-3,2.5999999999999999E-3,0.11,1.325E-2,1.075E-3,8.4999999999999995E-4,6.4999999999999997E-4,40150,4836.25,392.375,310.25,237.25,20.074999999999999]
["Manure pBAk","Solid (tons)",null,30,null,null,null,null,null,null,null,null,"Very Low","Low","Medium",null,"High",null,"Very High","Soil Test K",null,null,null,null,null,null,null,null,null,"sheep","lamb",100,4.0999999999999996,0.5,0.04,0.02,0.04,4.0999999999999995E-2,5.0000000000000001E-3,4.0000000000000002E-4,2.0000000000000001E-4,4.0000000000000002E-4,14964.999999999998,1825,146,73,146,7.482499999999999]
["Open lot","Solid (tons)",null,50,null,null,null,null,null,null,"Expected","Bray:","0-5","6-10","11-15",null,"16-20",null,"21+","Test values","Test values","Test values","Test values","Test values",null,null,null,null,null,"Horse","sedentary",1000,54.4,6.56,0.18,0.06,0.06,5.4399999999999997E-2,6.5599999999999999E-3,1.7999999999999998E-4,5.9999999999999995E-5,5.9999999999999995E-5,19856,2394.3999999999996,65.7,21.9,21.9,9.9280000000000008]
["Litter","Solid (tons)",null,35,null,null,null,null,null,null,"Yield","Olsen:","0-3","4-7","8-11",null,"12-15",null,"16+","0-40","41-80","81-120","121-160","161+",null,null,null,null,null,null,"exercise",1000,55.5,6.7,0.3,0.15,0.23,5.5500000000000001E-2,6.7000000000000002E-3,2.9999999999999997E-4,1.4999999999999999E-4,2.3000000000000001E-4,20257.5,2445.5,109.5,54.75,83.95,10.12875]
["Above ground tank","Liquid (gallons)",null,20,null,null,null,null,null,null,"All",null,80,55,35,null,10,null,0,110,80,50,15,0]
["Below ground covered pit","Liquid (gallons)",null,20,null,null,null,null,null,null,null,null,null,null,"Nitrogen recommendation is set to a flat rate of",100,"lb/BAre"]
["Below ground open pit","Liquid (gallons)",null,25,null,null,null,null,null,null,"Soybeans - Soybeans - Soybeans - Soybeans - Soybeans"]
["Under-floor dry storage","Solid (tons)",null,25,null,null,null,null,null,null,"Phosphorus Recommendations (Broadcast)"]
["Under-floor liquid storage","Liquid (gallons)",null,20,null,null,null,null,null,null,null,null,"Soil Test P (ppm)"]
["Earthen storage","Liquid (gallons)",null,30,null,null,null,null,null,null,null,null,"Very Low","Low","Medium",null,"High",null,"Very High"]
["Lagoon","Liquid (gallons)",null,75,null,null,null,null,null,null,"Expected","Bray:","0-5","6-10","11-15",null,"16-20",null,"21+"]
[null,null,null,null,null,null,null,null,null,null,"Yield","Olsen:","0-3","4-7","8-11",null,"12-15",null,"16+"]
["Use Uof MN, unless not available",null,null,null,null,null,null,null,null,null,"<30",null,50,30,0,null,0,null,0]
["Table A3.  Estimated nutrient content of liquid and solid manure",null,null,null,null,null,null,null,null,null,"30-39",null,60,40,0,null,0,null,0]
["Animal Type","Liquid Manure",null,null,"Solid Manure",null,null,null,null,null,"40-49",null,70,50,0,null,0,null,0]
[null,"N","P2O5","K2O","N","P2O5","K2O",null,null,null,"50-59",null,80,60,0,null,0,null,0]
[null,"lbs/1,000 gallons",null,null,"lbs/ton",null,null,null,null,null,"60+",null,90,70,0,null,0,null,0]
["Beef",null,null,null,null,null,null,null,null,null,"Calculated Phosphorus Recommendations (Used if test value is entered)"]
["Feeder Cattle High Forage",29,18,26,11,7,11,null,null,null,"P2O5 = [W - (X)*(Bray P ppm)]*(Expected Yield)",null,null,null,"W=",1.752,"X=",8.3599999999999994E-2]
["Feeder Cattle High Energy",29,18,26,11,7,11,null,null,null,"P2O5 = [Y - (Z)*(Olsen P ppm)]*(Expected Yield)",null,null,null,"Y=",1.752,"Z=",0.1114]
["Cow",20,16,24,7,4,7,null,null,null,"Calculated Potassium Recommendations (Used if test value is entered)"]
["Calf",27,18,24,9,4,8,null,null,null,"K2O = [A - (B)*(K ppm)]*(Expected Yield)",null,null,null,"A=",2.2000000000000002,"B=",0.183]
["Dairy"]
["Milk Cow",31,15,19,10,3,6,null,null,null,"Corn Silage - Corn Silage - Corn Silage - Corn Silage - Corn Silage"]
["Dry Cow",31,15,19,10,3,6,null,null,null,"Phosphorus Recommendations (Broadcast)"]
["Heifer",32,14,28,10,3,7,null,null,null,null,null,"Soil Test P (ppm)"]
["Calf",27,14,24,10,3,5,null,null,null,null,null,"Very Low","Low","Medium",null,"High",null,"Very High"]
["Swine",null,null,null,null,null,null,null,null,null,"Expected","Bray:","0-5","6-10","11-15",null,"16-20",null,"21+"]
["Swine - Nursery",25,19,22,13,8,4,null,null,null,"Yield","Olsen:","0-3","4-7","8-11",null,"12-15",null,"16+"]
["Swine - Wean/Finish",42,34,24,14,6,4,null,null,null,"<13",null,60,40,25,null,10,null,0]
["Swine- Wean/Finish (wet/dry feed)",57,46,34,14,6,4,null,null,null,"13-15",null,75,50,30,null,10,null,0]
["Swine - Grow/Finish",58,44,40,16,9,5,null,null,null,"16-18",null,85,60,35,null,10,null,0]
["Swine- Grow/Finish (wet/dry feed)",75,54,40,22,22,17,null,null,null,"19-21",null,100,70,40,null,15,null,0]
["Swine - Gestating Sow",25,25,24,9,7,5,null,null,null,"22+",null,110,75,45,null,15,null,0]
["Swine - LBAtating Sow",15,12,11,14,6,4,"Farrowing"]
["Swine - Boar",25,25,24,9,7,5,null,null,null,"Grass/Legume - Grass/Legume - Grass/Legume - Grass/Legume"]
["Poultry",null,null,null,null,null,null,null,null,null,"Phosphorus Recommendations (Broadcast)"]
["  Layers",57,52,33,34,51,26,null,null,null,null,null,"Soil Test P (ppm)"]
["  Broilers",63,40,29,46,53,36,null,null,null,null,null,"Very Low","Low","Medium",null,"High",null,"Very High"]
["  Turkey",56,39,31,40,50,30,"Avg of tom&Hen",null,null,"Expected","Bray:","0-5","6-10","11-15",null,"16-20",null,"21+"]
["Horse",null,null,null,14,4,14,null,null,null,"Yield","Olsen:","0-3","4-7","8-11",null,"12-15",null,"16+"]
["Sheep",null,null,null,18,11,26,null,null,null,"<3",null,35,25,15,null,0,null,0]
["open lot runoff",4,1,4,null,null,null,null,null,null,"3-4",null,55,40,25,null,10,null,0]
["milkhouse waste",1,0.5,1,null,null,null,null,null,null,"4-5",null,70,50,30,null,10,null,0]
["Table A4.  Nitrogen availability and loss as affected by method of manure application and animal species",null,null,null,null,null,null,null,null,null,"5+",null,90,65,40,null,15,null,0]
["Year Available1","Broadcast Incorporation Timing2",null,null,"Injection",null,null,null,null,null,"Calculated Phosphorus Recommendations (Used if test value is entered)"]
[null,"None to 96 hrs.","12 to 96 hrs.","<12 hrs.","Sweep","Knife",null,null,null,null,"P2O5 = [W - (X)*(Bray P ppm)]*(Expected Yield)",null,null,null,"W=",20,"X=",1]
[null,"% of Total Nitrogen Available Per Year",null,null,null,null,null,null,null,null,"P2O5 = [Y - (Z)*(Olsen P ppm)]*(Expected Yield)",null,null,null,"Y=",20,"Z=",1.4]
["Beef",null,null,null,null,null,null,null,null,null,"Calculated Potassium Recommendations (Used if test value is entered)"]
["  Year 1",25,45,60,60,50,null,null,null,null,"K2O = [A - (B)*(K ppm)]*(Expected Yield)",null,null,null,"A=",53.28,"B=",0.33300000000000002]
["  Year 2",25,25,25,25,25]
["  Lost",40,20,5,5,10,null,null,null,null,"Clover/Trefoil - Clover/Trefoil - Clover/Trefoil - Clover/Trefoil"]
["Dairy",null,null,null,null,null,null,null,null,null,"Phosphorus Recommendations (Broadcast)"]
["  Year 1",20,40,55,55,50,null,null,null,null,null,null,"Soil Test P (ppm)"]
["  Year 2",25,25,25,25,25,null,null,null,null,null,null,"Very Low","Low","Medium",null,"High",null,"Very High"]
["  Lost",40,20,10,5,10,null,null,null,null,"Expected","Bray:","0-5","6-10","11-15",null,"16-20",null,"21+"]
["Swine",null,null,null,null,null,null,null,null,null,"Yield","Olsen:","0-3","4-7","8-11",null,"12-15",null,"16+"]
["  Year 1",35,55,75,80,70,null,null,null,null,"<3",null,35,25,15,null,0,null,0]
["  Year 2",15,15,15,15,15,null,null,null,null,"3-4",null,55,40,25,null,10,null,0]
["  Lost",50,30,10,5,15,null,null,null,null,"4-5",null,70,50,30,null,10,null,0]
["Poultry",null,null,null,null,null,null,null,null,null,"5+",null,90,65,40,null,15,null,0]
["  Year 1",45,55,70,70,70,null,null,null,null,"Calculated Phosphorus Recommendations (Used if test value is entered)"]
["  Year 2",25,25,25,25,25,null,null,null,null,"P2O5 = [W - (X)*(Bray P ppm)]*(Expected Yield)",null,null,null,"W=",20,"X=",1]
["  Lost",30,20,5,null,null,null,null,null,null,"P2O5 = [Y - (Z)*(Olsen P ppm)]*(Expected Yield)",null,null,null,"Y=",20,"Z=",1.4]
["Horse and sheep have the same availabilities as Dairy (highly bedded manure)",null,null,null,null,null,null,null,null,null,"Calculated Potassium Recommendations (Used if test value is entered)"]
["1.  Third year available N is not listed but can be computed by adding 1st and 2nd year and lost percentages and subtracting this sum from 100.",null,null,null,null,null,null,null,null,null,"K2O = [A - (B)*(K ppm)]*(Expected Yield)",null,null,null,"A=",53.28,"B=",0.33300000000000002]
["2.  Timing categories refer to the length of time between manure application and incorporation."]
["Second Year Availability (%) based on Animal Types (used in Carry-over N calc's)",null,null,null,null,null,null,null,null,null,"NOTE: Alsike Clover, Birdsfoot Trefoil, and Red Clover are all treated the same as Clover/Trefoil"]
["Swine =",15]
["All Others =",25]
[]
["From IPNI.net"]
["Table A5.  Nutrient removal in the harvested portion of the crop.",null,null,null,null,null,null,null,null,null,"Silage tons to bushels of grain table"]
["Crop","Yield Units",null,"Crop Nutrient Removal            (lbs. per unit)",null,null,null,null,null,null,"Silage Yield (ton/BAre)",null,"Grain Yield (bu/BA)",null,"Grain Equivalent (bu/ton of silage)"]
[null,null,null,"N","P2O5","K2O",null,null,null,null,7.1,null,25,null,{"$f":"M321/K321","v":3.5211267605633805}]
["Alfalfa","tons (air dry)",null,51,12,49,null,null,null,null,9,null,50,null,5.5555555555555554]
["Alsike clover","tons (air dry)",null,41,11,54,null,null,null,null,11.1,null,75,null,6.756756756756757]
["Barley (grain) 1","bushels",null,0.99,0.4,0.32,null,null,null,null,13.4,null,100,null,7.4626865671641793]
["Barley (grain & straw) 1","bushels",null,1.39,0.56000000000000005,1.52,null,null,null,null,15.9,null,125,null,7.8616352201257858]
["Birdsfoot trefoil","tons (air dry)",null,45,11,42,null,null,null,null,18.7,null,150,null,8.0213903743315509]
["Buckwheat (grain) 1","bushels",null,0.83,0.25,0.22,null,null,null,null,22.2,null,175,null,7.8828828828828827]
["Buckwheat (grain & straw) 1","bushels",null,14.86,1.95,46.67,"usda Plants database",null,null,null,"8 bu of grain is equal to 1 ton of silage throughout program except P and K removal"]
["Canola","cwt.",null,1.6,0.8,0.4]
["Corn (grain)","bushels",null,0.67,0.35,0.25]
["Corn silage","tons (as fed)",null,9.6999999999999993,3.1,7.3,null,null,null,null,"Fertilizer","N","P","weight","Units","K"]
["Edible beans","pounds",null,0.05,1.2999999999999999E-2,1.4999999999999999E-2,"ipni - 1 bu = 60 lbs",null,null,null,"UAN (28% N)",28,0,10.66,"gal/acre",0]
["Grass hay or pasture","tons (air dry)",null,27.06,3.9,25.83,"usda Plants database",null,null,null,"UAN (32% N)",32,0,11.06,"gal/acre",0]
["Grass/legume","tons (air dry)",null,40.17,4.07,25.11,"usda Plants database Grass + clover-red",null,null,null,"Liquid 10-34-0",10,34,11.65,"gal/acre",0]
["Millet","pounds",null,1.4,0.4,0.4,null,null,null,null,"Liquid 9-18-9",9,18,11.11,"gal/acre",9]
["Oats (grain) 1","bushels",null,0.77,0.28000000000000003,0.19,null,null,null,null,"Liquid 7-21-7",7,21,11,"gal/acre",7]
["Oats (grain & straw) 1","bushels",null,1.08,0.44,1.1299999999999999,null,null,null,null,"Liquid Amm. Thiosulfate (12-0-0-26)",12,0,11,"gal/acre",0]
["Peas","pounds",null,null,0.01,0.01,"2010 data",null,null,null,"Urea (46% N)",46,0,"N/A","lbs/acre",0]
["Potatoes","cwt.",null,0.3,0.15,0.65,null,null,null,null,"Anhydrous Ammonia (82% N)",82,0,"N/A","lbs/acre",0]
["Red clover","tons (air dry)",null,45,12,42,null,null,null,null,"Ammonium Sulfate (21-0-0-26S)",21,0,"N/A","lbs/acre",0]
["Rye (grain) 1","bushels",null,1.4,0.46,0.31,null,null,null,null,"DAP (18-46-0)",18,46,"N/A","lbs/acre",0]
["Rye (grain & straw) 1","bushels",null,2.2000000000000002,0.67,1.81,null,null,null,null,"MAP (11-48-0)",11,48,"N/A","lbs/acre",0]
["Soybeans","bushels",null,3.5,0.82,1,null,null,null,null,"Triple Superphosphate (0-46-0)",0,46,"N/A","lbs/acre",0]
["Sugar beets","tons",null,3.7,2.2000000000000002,7.3,null,null,null,null,"Blend 5-14-42",5,15,"N/A","lbs/acre",42]
["Sunflowers","pounds",null,2.7,0.97,0.9,null,null,null,null,"Blend 9-23-30",9,23,"N/A","lbs/acre",30]
["Sweet corn","tons",null,null,11,13.9,"2010 data",null,null,null,"Potassium Chloride (0-0-60)",0,0,"N/A","lbs/acre",60]
["Wheat (grain) 1","bushels",null,1.35,0.53,0.31,"avg of spring and winter",null,null,null,"Potassium Sulfate (0-0-50-18(S))",0,0,"N/A","lbs/acre",50]
["Wheat (grain & straw) 1","bushels",null,2.0499999999999998,0.69,1.51,null,null,null,null,"Sul-Po-Mag (0-0-22-22(S)-11(Mg))",0,0,"N/A","lbs/acre",22]
["Fallow = grass/hay","tons",null,{"$f":"D333","v":27.06},{"$f":"E333","v":3.9},{"$f":"F333","v":25.83},null,null,null,null,"Potassium Nitrate (13-0-44)",13,0,"N/A","lbs/acre",44]
["Pasture = grass/hay","tons",null,{"$f":"D333","v":27.06},{"$f":"E333","v":3.9},{"$f":"F333","v":25.83},null,null,null,null,"Custom"]
["Sorghum (forage)","tons",null,30,9.5,34]
["Vegetables = sweet corn","tons",null,{"$f":"D346","v":0},{"$f":"E346","v":11},{"$f":"F346","v":13.9}]
["1.  Nutrient removal, used in calculations in this spreadhseet, is based on the average of grain only and grain and straw numbers from this table"]
["Hidden is that chart that calculates the fBAtors for evaporation loss of soild manure for the storage categories identified.  The chart was developed by Dave Wall."]
["Spreadsheet from Dave Wall to Adjust the estimate of tonnage of soild mannure to BAcount for losses in volume as a result of storage.","wt of animal","lbsperday of manure","tonsperyr of excreted manure","N lbs/yr excreted","P lbs/yr excreted","Avail N after daily haul losses lbs/year","Avail N after manure pBAk losses lbs/year","Avail N after losses in open lot lbs/year","P after stg (95% still available) lbs/year",null,"Scrape and haul (N concentration if N after storage losses is divided by lbs manure excreted) ",null,"Manure PBAk N (N concentration if N after storage losses is divided by lbs manure excreted lbsN/ton manure)","Open lot N (N concentration if N after storage losses is divided by lbs manure excreted - lbs N/ton manure)",null,null,"P lbs/ton (P concentration if P after 5% storage losses is divided by lbs manure excreted)",null,"N - book value","P - book value","daily scrape and haul - frBAtion of manure weight that is not lost through evaporation to BAhieve book value N","manure pBAk - frBAtion of manure weight that is not lost through evaporation to BAhieve book value N","open lot - frBAtion of manure weight that is not lost through evaporation to BAhieve book value N","P frBAtion of manure weight that is not lost through evaporation to BAhieve book value P","Dave's recommended multiplier of excreted tonnage to BAhieve closer to tonnage that is BAtually applied"]
["Heifer",750,65,{"$f":"(C356*365/2000)","v":11.862500000000001},{"$f":"0.23*365","v":83.95},{"$f":"0.07*365","v":25.55},{"$f":"(E356*0.75)","v":62.962500000000006},{"$f":"(E356*0.7)","v":58.765000000000001},{"$f":"(E356*0.5)","v":41.975000000000001},{"$f":"(F356*0.95)","v":24.272500000000001},null,{"$f":"(G356/D356)","v":5.3076923076923075},null,{"$f":"(H356/D356)","v":4.953846153846154},{"$f":"(I356/D356)","v":3.5384615384615383},null,null,{"$f":"(J356/D356)","v":2.046153846153846},null,13,12,{"$f":"(L356/T356)","v":0.40828402366863903},{"$f":"(N356/T356)","v":0.38106508875739648},{"$f":"(O356/T356)","v":0.27218934911242604},{"$f":"(R356/U356)","v":0.17051282051282049}]
["D. Cow",1000,106,{"$f":"(C357*365/2000)","v":19.344999999999999},{"$f":"0.58*365","v":211.7},{"$f":"0.3*365","v":109.5},158.77499999999998,148.18999999999997,105.85,104.02499999999999,null,8.2075471698113205,null,7.6603773584905648,5.4716981132075473,null,null,5.3773584905660377,null,11,7,0.74614065180102918,0.69639794168096047,0.49742710120068612,0.76819407008086249,0.76]
["Cow",1400,148,{"$f":"(C358*365/2000)","v":27.01},{"$f":"0.82*365","v":299.29999999999995},{"$f":"0.42*365","v":153.29999999999998},224.47499999999997,209.50999999999996,149.64999999999998,145.63499999999999,null,8.3108108108108087,null,7.7567567567567552,5.5405405405405395,null,null,5.3918918918918912,null,11,7,0.75552825552825531,0.70515970515970505,0.50368550368550358,0.77027027027027017,0.76]
["dry cow",1000,82,14.965,{"$f":"0.36*365","v":131.4},{"$f":"0.11*365","v":40.15},98.550000000000011,91.98,65.7,38.142499999999998,null,6.5853658536585371,null,6.1463414634146343,4.3902439024390247,null,null,2.5487804878048781,null,11,7,0.59866962305986704,0.55875831485587579,0.39911308203991136,0.36411149825783973]
["Beef ",750,54,9.8550000000000004,{"$f":"0.41*365","v":149.64999999999998},{"$f":"0.14*365","v":51.1},112.23749999999998,104.75499999999998,74.824999999999989,48.545000000000002,null,11.388888888888888,null,10.629629629629628,7.5925925925925908,null,null,4.9259259259259256,null,14,9,0.81349206349206338,0.75925925925925919,0.54232804232804221,0.54732510288065839,0.68]
["Beef ",1100,80,14.6,{"$f":"0.51*365","v":186.15},{"$f":"0.21*365","v":76.649999999999991},139.61250000000001,130.30500000000001,93.075000000000003,72.817499999999995,null,9.5625000000000018,null,8.9250000000000007,6.375,null,null,4.9874999999999998,null,14,9,0.68303571428571441,0.63750000000000007,0.45535714285714285,0.5541666666666667,0.68]
["Layer",4,0.26,4.7450000000000006E-2,{"$f":"0.0035*365","v":1.2775000000000001},{"$f":"0.0027*365","v":0.98550000000000004},0.95812500000000012,0.89424999999999999,0.63875000000000004,0.93622499999999997,null,20.192307692307693,null,18.846153846153843,13.46153846153846,null,null,19.730769230769226,null,34,51,0.59389140271493213,0.55429864253393657,0.39592760180995468,0.38687782805429854,0.4]
["broiler",2,0.18,3.2850000000000004E-2,{"$f":"0.0023*365","v":0.83950000000000002},{"$f":"0.0014*365","v":0.51100000000000001},0.62962499999999999,0.58765000000000001,0.41975000000000001,0.48544999999999999,null,19.166666666666664,null,17.888888888888886,12.777777777777777,null,null,14.777777777777775,null,46,53,0.41666666666666663,0.38888888888888884,0.27777777777777773,0.27882599580712786,0.4]
["Turkey",20,0.9,0.16425000000000001,{"$f":"0.0126*365","v":4.5990000000000002},{"$f":"0.0108*365","v":3.9420000000000002},3.4492500000000001,3.2193000000000001,2.2995000000000001,3.7448999999999999,null,21,null,19.599999999999998,14,null,null,22.799999999999997,null,44,63,0.47727272727272729,0.44545454545454538,0.31818181818181818,0.36190476190476184,0.4]
["Summary of evaporative losses of solid manure for the storage types identified."]
["Dairy Calf = Dairy Heifer & Beef Calf = Beef Heifer"]
["Animal Type","Scrape and Haul/Stockpile/Underfloor Dry",null,null,"Manure PBAk",null,"Litter"]
["Dairy Milk Cow",{"$f":"V358","v":0.75552825552825531},null,null,{"$f":"W358","v":0.70515970515970505},null,1,"(Cancels out in calcs)"]
["Dairy Dry Cow",{"$f":"V359","v":0.59866962305986704},null,null,{"$f":"W359","v":0.55875831485587579},null,1,"(Cancels out in calcs)"]
["Dairy Heifer",{"$f":"V356","v":0.40828402366863903},null,null,{"$f":"W356","v":0.38106508875739648},null,1,"(Cancels out in calcs)"]
["Beef Feeder (High Forage)",{"$f":"V361","v":0.68303571428571441},null,null,{"$f":"W361","v":0.63750000000000007},null,1,"(Cancels out in calcs)"]
["Beef Feeder (High Energy)",{"$f":"V361","v":0.68303571428571441},null,null,{"$f":"W361","v":0.63750000000000007},null,1,"(Cancels out in calcs)"]
["Beef Cow",{"$f":"V361","v":0.68303571428571441},null,null,{"$f":"W361","v":0.63750000000000007},null,1,"(Cancels out in calcs)"]
["Chickens - Layer",{"$f":"V362","v":0.59389140271493213},null,null,{"$f":"W362","v":0.55429864253393657},null,1,"(Cancels out in calcs)"]
["Chickens - Broiler",{"$f":"V363","v":0.41666666666666663},null,null,{"$f":"W363","v":0.38888888888888884},null,1,"(Cancels out in calcs)"]
["Turkeys",{"$f":"V364","v":0.47727272727272729},null,null,{"$f":"W364","v":0.44545454545454538},null,{"$f":"AVERAGE(B376,E376)","v":0.46136363636363631}]
[]
[]
["SWEET CORN - SWEET CORN - SWEET CORN - SWEET CORN - SWEET CORN - SWEET CORN - SWEET CORN - SWEET CORN - SWEET CORN"]
[null,"Nitrogen Recommendations",null,null,null,null,null,null,null,null,"Phosphorus Recommendations (Broadcast)"]
[null,null,"Expected Yield (tons/BAre)",null,null,null,null,null,null,null,null,null,"Soil Test P (ppm)"]
["Crop Grown Last Year","Organic Matter Level","<6","6-7","8-9","10+",null,null,null,null,null,null,"Very Low","Low","Medium",null,"High",null,"Very High"]
["Alfalfa 2+ year old stand","low",10,30,50,70,null,null,"good",null,"Expected","Bray:","0-5","6-10","11-15",null,"16-20",null,"21+"]
[null,"med/high",0,0,20,40,null,null,null,null,"Yield","Olsen:","0-3","4-7","8-11",null,"12-15",null,"16+"]
["Alfalfa 1 year old stand","low",70,90,110,130,null,null,"fair and poor",null,"<6",null,40,25,20,null,15,null,10]
[null,"med/high",40,60,80,100,null,null,null,null,"6-7",null,40,30,20,null,15,null,10]
["Soybeans","low",80,100,120,140,null,null,null,null,"8-9",null,40,35,25,null,15,null,10]
[null,"med/high",50,70,90,110,null,null,null,null,"10+",null,40,40,25,null,15,null,10]
["Edible beans, field peas","low",80,100,120,140]
[null,"med/high",50,70,90,110]
["Group 1 Crops: Clover, fallow, grass/legume hay, grass/leg, pasture, etc.","low",70,90,110,130,null,null,null,null,"Calculated Phosphorus Recommendations (Used if test value is entered)"]
[null,"med/high",40,60,80,100,null,null,null,null,"P2O5 = [W - (X)*(Bray P ppm)]*(Expected Yield)",null,null,null,"W=",11,"X=",0.53300000000000003]
["Group 2 Crops: Corn, wheat, oats, potatoes, sugar beets, grass, rye, etc.","low",110,130,150,170,null,null,null,null,"P2O5 = [Y - (Z)*(Olsen P ppm)]*(Expected Yield)",null,null,null,"Y=",11,"Z=",0.7]
[null,"med/high",80,100,120,140]
[]
["Calculated Potassium Recommendations (Used if test value is entered)"]
["K2O = [A - (B)*(K ppm)]*(Expected Yield)",null,null,null,"A=",22,"B=",0.13]
[]
["PEAS - PEAS - PEAS - PEAS - PEAS - PEAS - PEAS - PEAS - PEAS - PEAS - PEAS - PEAS - PEAS - PEAS - PEAS - PEAS - PEAS - PEAS - PEAS"]
[null,"Nitrogen Recommendations",null,null,null,null,null,null,null,null,"Phosphorus Recommendations (Broadcast)"]
[null,null,"Expected Yield (lbs/BAre)",null,null,null,null,null,null,null,null,null,"Soil Test P (ppm)"]
["Crop Grown Last Year","Organic Matter Level","<1000","1000-1900","2000-3900","4000+",null,null,null,null,null,null,"Very Low","Low","Medium",null,"High",null,"Very High"]
["Alfalfa 2+ year old stand","low",0,0,0,0,null,null,"good",null,"Expected","Bray:","0-5","6-10","11-15",null,"16-20",null,"21+"]
[null,"med/high",0,0,0,0,null,null,null,null,"Yield","Olsen:","0-3","4-7","8-11",null,"12-15",null,"16+"]
["Alfalfa 1 year old stand","low",0,0,0,10,null,null,"fair and poor",null,"<1000",null,25,15,0,null,0,null,0]
[null,"med/high",0,0,0,0,null,null,null,null,"1000-1900",null,50,25,15,null,0,null,0]
["Soybeans","low",0,0,10,20,null,null,null,null,"2000-3900",null,75,50,25,null,15,null,0]
[null,"med/high",0,0,0,0,null,null,null,null,"4000+",null,100,75,50,null,25,null,0]
["Edible beans, field peas","low",0,0,10,20]
[null,"med/high",0,0,0,0]
["Group 1 Crops: Clover, fallow, grass/legume hay, grass/leg, pasture, etc.","low",0,0,0,10,null,null,null,null,"Calculated Phosphorus Recommendations (Used if test value is entered)"]
[null,"med/high",0,0,0,0,null,null,null,null,"P2O5 = [W - (X)*(Bray P ppm)]*(Expected Yield)",null,null,null,"W=",1.7100000000000001E-2,"X=",8.4999999999999995E-4]
["Group 2 Crops: Corn, wheat, oats, potatoes, sugar beets, grass, rye, etc.","low",0,10,20,40,null,null,null,null,"P2O5 = [Y - (Z)*(Olsen P ppm)]*(Expected Yield)",null,null,null,"Y=",1.7100000000000001E-2,"Z=",1.1000000000000001E-3]
[null,"med/high",0,0,10,20]
[]
["Calculated Potassium Recommendations (Used if test value is entered)"]
["K2O = [A - (B)*(K ppm)]*(Expected Yield)",null,null,null,"A=",0.03,"B=",1.8000000000000001E-4]
[]
["POTATOES - POTATOES - POTATOES - POTATOES - POTATOES - POTATOES - POTATOES - POTATOES - POTATOES - POTATOES"]
[null,"Nitrogen Recommendations"]
[null,null,"Expected Yield (cwt/BAre)"]
["Crop Grown Last Year","Organic Matter Level","<200","200-249","250-299","300-349","350-399","400-449","450-499","500+"]
["Alfalfa 2+ year old stand","low",0,0,25,50,75,100,125,150,"good"]
[null,"med/high",0,0,0,30,55,80,105,130]
["Alfalfa 1 year old stand","low",35,60,85,110,135,160,185,210,"fair & poor"]
[null,"med/high",15,40,65,90,115,140,165,190]
["Soybeans","low",55,80,105,130,155,180,205,230]
[null,"med/high",35,60,85,110,135,160,185,210]
["Edible beans, field peas","low",55,80,105,130,155,180,205,230]
[null,"med/high",35,60,85,110,135,160,185,210]
["Group 1 Crops: Clover, fallow, grass/legume hay, grass/leg, pasture, etc.","low",35,60,85,110,135,160,185,210]
[null,"med/high",15,40,65,90,115,140,165,190]
["Group 2 Crops: Corn, wheat, oats, potatoes, sugar beets, grass, rye, etc.","low",75,100,125,150,175,200,225,250]
[null,"med/high",55,80,105,130,155,180,205,230]
[]
["Phosphorus Recommendations (Broadcast)"]
[null,null,"Soil Test P (ppm)"]
[]
["Expected","Bray:","0-5","6-10","11-15","16-20","21-25","26-30","31-50","51+"]
["Yield","Olsen:","0-3","4-7","8-11","12-15","16-18","19-22","23-41","42+"]
["<200",null,75,50,25,0,0,0,0,0]
["200-249",null,100,75,50,25,0,0,0,0]
["250-299",null,100,75,50,25,0,0,0,0]
["300-349",null,125,100,75,50,50,50,50,50]
["350-399",null,125,100,75,50,50,50,50,50]
["400-449",null,150,125,100,75,75,75,75,75]
["450-500",null,150,125,100,75,75,75,75,75]
["500+",null,175,150,125,100,100,100,100,100]
["Calculated Phosphorus Recommendations (Used if test value is entered)"]
["P2O5 = [W - (X)*(Bray P ppm)]*(Expected Yield)",null,null,null,"W=",0.5,"X=",2.4E-2]
["P2O5 = [Y - (Z)*(Olsen P ppm)]*(Expected Yield)",null,null,null,"Y=",0.5,"Z=",3.4000000000000002E-2]
["Calculated Potassium Recommendations (Used if test value is entered)"]
["K2O = [A - (B)*(K ppm)]*(Expected Yield)",null,null,null,"A=",0.85,"B=",5.7000000000000002E-3]
[]
["SORGHUM (forage) - SORGHUM (forage) - SORGHUM (forage) - SORGHUM (forage) - SORGHUM (forage) - SORGHUM (forage) - SORGHUM (forage)"]
[null,"Nitrogen Recommendations",null,null,null,null,null,null,null,null,"Phosphorus Recommendations (Broadcast)"]
[null,null,"Expected Yield (tons/BAre)",null,null,null,null,null,null,null,null,null,"Soil Test P (ppm)"]
["Crop Grown Last Year","Organic Matter Level","<4","5-6","7-8","9+",null,null,null,null,null,null,"Very Low","Low","Medium",null,"High",null,"Very High"]
["Alfalfa 2+ year old stand","low",0,0,{"$f":"E460","v":25},{"$f":"F460","v":75},null,null,"good",null,"Expected","Bray:","0-5","6-10","11-15",null,"16-20",null,"21+"]
[null,"med/high",0,0,{"$f":"E470-150","v":25},{"$f":"F470-150","v":75},null,null,null,null,"Yield","Olsen:","0-3","4-7","8-11",null,"12-15",null,"16+"]
["Alfalfa 1 year old stand","low",0,{"$f":"D462","v":25},{"$f":"E462","v":75},{"$f":"F462","v":125},null,null,"fair",null,"<4",null,30,21,13,null,5,null,0]
[null,"med/high",0,{"$f":"D470-100","v":25},{"$f":"E470-100","v":75},{"$f":"F470-100","v":125},null,null,null,null,"5-6",null,50,36,22,null,8,null,0]
["Soybeans","low",{"$f":"C464","v":35},{"$f":"D464","v":85},{"$f":"E464","v":135},{"$f":"F464","v":185},null,null,"poor",null,"7-8",null,70,50,30,null,11,null,0]
[null,"med/high",{"$f":"C470-40","v":35},{"$f":"D470-40","v":85},{"$f":"E470-40","v":135},{"$f":"F470-40","v":185},null,null,null,null,"9+",null,90,64,39,null,14,null,0]
["Edible beans, field peas","low",{"$f":"C466","v":35},{"$f":"D466","v":85},{"$f":"E466","v":135},{"$f":"F466","v":185}]
[null,"med/high",{"$f":"C470-40","v":35},{"$f":"D470-40","v":85},{"$f":"E470-40","v":135},{"$f":"F470-40","v":185}]
["Group 1 Crops: Clover, fallow, grass/legume hay, grass/leg, pasture, etc.","low",{"$f":"C468","v":35},{"$f":"D468","v":85},{"$f":"E468","v":135},{"$f":"F468","v":185},null,null,null,null,"Calculated Phosphorus Recommendations (Used if test value is entered)"]
[null,"med/high",{"$f":"C470-40","v":35},{"$f":"D470-40","v":85},{"$f":"E470-40","v":135},{"$f":"F470-40","v":185},null,null,null,null,"P2O5 = [W - (X)*(Bray P ppm)]*(Expected Yield)",null,null,null,"W=",11,"X=",0.53300000000000003]
["Group 2 Crops: Corn, wheat, oats, potatoes, sugar beets, grass, rye, etc.","low",75,125,175,225,null,null,null,null,"P2O5 = [Y - (Z)*(Olsen P ppm)]*(Expected Yield)",null,null,null,"Y=",11,"Z=",0.7]
[null,"med/high",75,125,175,225]
["Alfalfa good = 2+, Fair = 1 yr, poor considered group 2"]
["Calculated Potassium Recommendations (Used if test value is entered)",null,null,null,null,null,null,null,null,null,null,"Second Year Legume Credit"]
["K2O = [A - (B)*(K ppm)]*(Expected Yield)",null,null,null,"A=",43,"B=",0.3]
[null,null,null,null,null,null,null,null,null,null,null,null,"Legume Crop",null,"Credit"]
[null,null,null,null,null,null,null,null,null,null,null,null,"Alfalfa 2+ year old stand",null,75]
[null,null,null,null,null,null,null,null,null,null,null,null,"Alfalfa 1 year old stand",null,25]
[null,null,null,null,null,null,null,null,null,null,null,null,"Red Clover",null,20]

{"sheet":"List Choices","index":2,"n_rows":66,"n_cols":8,"rows_kept":66,"cut":false,"hidden":true,"merged":[[0,3,0,4]]}
["Application","Application_2",null,"Used for LOOKUP",null,null,"Print Sheets?"]
["Sweep Injection","Sweep Injection","Crops_2","Crops_2 (alphabetical)","units",null,"MMP",false]
["Knife Injection","Knife Injection","Corn","Alfalfa","ton",null,"Records",false]
["Incorp. within 12 hrs","Incorporation within 12 hrs","Soybeans","Alsike Clover","ton",null,"Sheet78",false]
["Incorp. within 4 days","Incorporation within 4 days","Alfalfa","Barley","bu",null,"Sheet77",false]
["Incorp. after 4 days","Incorporation after 4 days","Alsike Clover","Birdsfoot Trefoil","ton",null,"Sheet76",false]
[null,null,"Barley","Buckwheat","lb",null,"Sheet75",false]
["Animals","Manure_test","Birdsfoot Trefoil","Canola","cwt",null,"Sheet74",false]
["Dairy","MPCA or U of MN Guidelines","Buckwheat","Corn","bu",null,"Sheet79",false]
["Beef","Well Agitated Composite","Canola","Corn Silage","ton"]
["Swine","Well Agitated Single Sample","Corn Silage","Edible Beans","lb"]
["Poultry","Non-Agitated Composite","Edible Beans","Grass/Hay","ton",null,"Registered_animals"]
["Horse","Non-Agitated Single Sample","Grass/Hay","Grass/Legume","ton",null,"Dairy – mature cow (milked or dry) over 1,000 lbs. "]
["Sheep","Stockpile Composite","Grass/Legume","Millet","lb",null,"Dairy – mature cow (milked or dry) under 1,000 lbs. "]
[null,"Stockpile Single Sample","Millet","Oats","bu",null,"Dairy – heifer "]
["App_Time","Sample from Spreader Load","Oats","Peas","lb",null,"Dairy – calf "]
["Spring","No Sample","Peas","Potatoes","cwt",null,"Beef – slaughter steer or stock cow "]
["Summer","Estimate (New Structure)","Potatoes","Red Clover","ton",null,"Beef – feeder cattle (stocker or backgrounding) or heifer "]
["Early Fall",null,"Red Clover","Rye","bu",null,"Beef – cow and calf pair "]
["Late Fall","Sampling","Rye","Sorghum","ton",null,"Beef – calf "]
["Winter","Every Year","Sorghum","Soybeans","bu",null,"Veal – calf "]
["Spring & Fall","Every 2 Years","Sugarbeets","Sugarbeets","ton",null,"Swine – over 300 pounds "]
["Monthly","Every 3 Years","Sunflowers","Sunflowers","lb",null,"Swine – between 55 and 300 pounds "]
["Weekly","Every 4 Years","Sweet Corn","Sweet Corn","ton",null,"Swine – under 55 pounds (and separated from sow) "]
["Daily","No Sampling","Wheat","Wheat","bu",null,"Horse "]
[null,null,null,null,null,null,"Sheep or lamb "]
["Animal_2","Storage","Crops_P","Summer_Crops","MULTIYEAR",null,"Chickens – all sizes with liquid manure system "]
["Beef Feeder (High Forage)","Earthen Basin","Corn","Alfalfa",1,null,"Chickens – broiler 5 lbs. and over – dry manure system "]
["Beef Feeder (High Energy)","Underfloor Concrete Pit","Soybeans","Barley",2,null,"Chickens – broiler under 5 lbs. – dry manure system "]
["Beef Cow","Outdoor Concrete Pit/Tank","Alfalfa","Buckwheat",3,null,"Chickens – layers 5 lbs. and over – dry manure system "]
["Beef Calf","Slurry Store","Alsike Clover","Canola",4,null,"Chickens – layers under 5 lbs. – dry manure system "]
["Chickens - Layer","Stockpile","Barley","Clover/Trefoil",5,null,"Turkeys – over 5 lbs. "]
["Chickens - Broiler","Lagoon","Barley w/ Straw","Corn",6,null,"Turkeys – under 5 lbs. "]
["Dairy Milk Cow","Manure Pack","Birdsfoot Trefoil","Corn Silage",null,null,"Ducks – dry manure system "]
["Dairy Dry Cow","Daily Scrape and Haul","Buckwheat","Edible Beans","YES_NO",null,"Ducks – liquid manure system "]
["Dairy Heifer","Litter","Buckwheat w/ Straw","Fallow","Yes",null,"Other animals (not listed above):"]
["Dairy Calf","Underfloor Dry Storage","Canola","Grass/Hay","No"]
["Swine - Nursery",null,"Corn Silage","Grass/Legume",null,"Crops_High_P","Crops_3"]
["Swine - Wean/Finish","Spreader","Edible Beans","Millet","Units","Repeat from Year 1","Corn"]
["Swine- Wean/Finish (wet/dry feed)","Liquid Tanker","Grass/Hay","Oats","lbs/1000 gal","Corn","Soybeans"]
["Swine - Grow/Finish","Solids Spreader","Grass/Legume","Pasture","lbs/ton","Soybeans","Alfalfa (1 yr old stand)"]
["Swine- Grow/Finish (wet/dry feed)","Towed Hose","Oats","Peas",null,"Alfalfa","Alfalfa (2+ yr old stand)"]
["Swine - Gestating Sow","Center Pivot","Oats w/ Straw","Potatoes","Manure_Sources","Alsike Clover","Alsike Clover"]
["Swine - Lactating Sow","Traveling Gun","Millet","Rye",{"$f":"IF('P Worksheet'!J5<>\"\",1,\"\")","v":""},"Barley","Barley"]
["Swine - Boar","Other","Peas","Sorguhm",{"$f":"IF('P Worksheet'!J6<>\"\",2,\"\")","v":""},"Barley w/ Straw","Birdsfoot Trefoil"]
["Turkeys",null,"Potatoes","Soybeans",{"$f":"IF('P Worksheet'!J7<>\"\",3,\"\")","v":""},"Birdsfoot Trefoil","Buckwheat"]
["Horse","Volume","Red Clover","Sugarbeets",{"$f":"IF('P Worksheet'!J8<>\"\",4,\"\")","v":""},"Buckwheat","Canola"]
["Sheep","Scales","Rye","Sunflowers",{"$f":"IF('P Worksheet'!J9<>\"\",5,\"\")","v":""},"Buckwheat w/ Straw","Corn Silage"]
["Open Lot Runoff","Spreader Volume","Rye w/ Straw","Sweet Corn",{"$f":"IF('P Worksheet'!J10<>\"\",6,\"\")","v":""},"Canola","Edible Beans"]
["Milkhouse Waste","Commercial Applicator","Sugarbeets","Vegetables",{"$f":"IF('P Worksheet'!J11<>\"\",7,\"\")","v":""},"Corn Silage","Grass/Hay"]
["Other Process Wastewater","Unknown","Sunflowers","Wheat",{"$f":"IF('P Worksheet'!J12<>\"\",8,\"\")","v":""},"Edible Beans","Grass/Legume"]
[null,"Other","Sweet Corn",null,null,"Grass/Hay","Millet"]
["Sample_Basis",null,"Wheat",null,null,"Grass/Legume","Oats"]
["Last Year's Sample","Calibration","Wheat w/ Straw",null,null,"Oats","Peas"]
["This Year's Sample","Loads Applied per Field",null,null,null,"Oats w/ Straw","Potatoes"]
["Average of Previous Samples","Acres Covered by One Load",null,null,null,"Millet","Red Clover"]
["Book Value","Plastic Sheet Sample",null,null,null,"Peas","Rye"]
["Estimate","Commercial Applicator",null,null,null,"Potatoes","Sorghum"]
[null,"Flowmeter",null,null,null,"Red Clover","Sugarbeets"]
[null,"Unknown",null,null,null,"Rye","Sunflowers"]
[null,"Other",null,null,null,"Rye w/ Straw","Sweet Corn"]
[null,null,null,null,null,"Sugarbeets","Wheat"]
[null,null,null,null,null,"Sunflowers"]
[null,null,null,null,null,"Sweet Corn"]
[null,null,null,null,null,"Wheat"]
[null,null,null,null,null,"Wheat w/ Straw"]

{"sheet":"Macros Disabled","index":3,"n_rows":10,"n_cols":2,"rows_kept":10,"cut":false,"hidden":false,"merged":[[9,1,9,12],[1,1,1,14],[4,1,4,6],[5,1,5,6],[7,1,7,12],[8,1,8,12]]}
[]
[null,"Sorry, you must enable macros in order to use this workbook."]
[]
[null,"Instructions for Excel 2007 and newer"]
[null,"When you open the workbook you need to click the \"Options\" button located just below the ribbon and choose the \"Enable this content\" option."]
[null,"There is no need to close and re-open the spreadsheet once this action is performed.  Microsoft Excel will make the changes needed to continue using the program without interuption."]
[null,"Instructions for Excel versions prior to 2007"]
[null,"1.  When you open the workbook you need to click the Enable Macros button."]
[null,"2.  If you do not see a warning, your macro security may be set to 'High'.  You can change this by clicking\nTools, Macros, Security from Excel's main menu.  Select Medium, which will still allow you to choose whether or not you run macros in a workbook.  (See Below)  (This is the procedure for Microsoft Excel 2000, 2002, & XP)"]
[null,"3. You will then need to close and re-open the file in order to use this spreadsheet."]

{"sheet":"Checklist","index":4,"n_rows":417,"n_cols":39,"rows_kept":417,"cut":false,"hidden":true,"merged":[[6,5,6,24],[192,21,238,24],[284,1,284,2],[284,3,284,20],[274,21,283,24],[277,1,277,2],[277,3,277,16],[277,17,278,17],[277,18,278,18],[277,19,278,19],[277,20,278,20],[278,1,278,2],[278,3,278,16],[279,1,279,2],[279,3,279,16],[279,17,280,17],[279,18,280,18],[279,19,280,19],[279,20,280,20],[280,1,280,2],[280,3,280,16],[281,1,281,2],[281,3,281,16],[282,1,282,2],[282,3,282,16],[282,17,283,17],[282,18,283,18],[282,19,283,19],[282,20,283,20],[283,1,283,2],[283,3,283,16],[275,1,275,2],[275,3,275,16],[275,17,276,17],[240,21,245,24],[253,1,253,20],[263,21,272,24],[271,17,272,17],[271,18,272,18],[271,19,272,19],[271,20,272,20],[266,17,267,17],[266,18,267,18],[266,19,267,19],[266,20,267,20],[264,1,264,2],[264,3,264,16],[264,17,265,17],[264,18,265,18],[264,19,265,19],[262,3,262,20],[262,1,262,2],[263,1,263,2],[263,3,263,16],[267,1,267,2],[267,3,267,16],[266,1,266,2],[266,3,266,16],[258,1,258,2],[258,3,258,16],[259,1,259,2],[259,3,259,16],[260,1,260,2],[271,1,271,2],[271,3,271,16],[239,1,239,2],[273,3,273,20],[197,17,198,17],[197,18,198,18],[197,19,198,19],[197,20,198,20],[198,1,198,2],[198,3,198,16],[264,20,265,20],[265,1,265,2],[265,3,265,16],[228,1,228,2],[228,3,228,16],[228,17,229,17],[228,18,229,18],[228,19,229,19],[228,20,229,20],[229,1,229,2],[229,3,229,16],[230,1,230,2],[230,3,230,16],[230,17,231,17],[230,18,231,18],[230,19,231,19],[230,20,231,20],[231,1,231,2],[231,3,231,16],[260,20,261,20],[261,1,261,2],[261,3,261,16],[255,19,256,19],[213,3,213,16],[216,1,216,2],[255,1,255,2],[255,3,255,16],[255,17,256,17],[255,18,256,18],[241,1,241,2],[241,3,241,16],[241,17,242,17],[241,18,242,18],[240,1,240,2],[240,3,240,16],[237,17,238,17],[237,18,238,18],[222,1,222,2],[222,3,222,16],[224,1,224,2],[224,3,224,16],[221,1,221,2],[221,3,221,16],[221,17,223,17],[248,1,248,2],[248,3,248,16],[249,1,249,2],[249,3,249,16],[250,1,250,2],[252,1,252,2],[252,3,252,16],[250,3,250,16],[251,1,251,2],[237,1,237,2],[237,3,237,16],[275,18,276,18],[275,19,276,19],[275,20,276,20],[276,1,276,2],[276,3,276,16],[254,1,254,2],[254,3,254,16],[273,1,273,2],[274,1,274,2],[274,3,274,16],[272,1,272,2],[272,3,272,16],[268,1,268,2],[268,3,268,16],[268,17,269,17],[268,18,269,18],[268,19,269,19],[268,20,269,20],[269,1,269,2],[269,3,269,16],[270,1,270,2],[256,1,256,2],[256,3,256,16],[257,1,257,2],[257,3,257,16],[257,17,258,17],[257,18,258,18],[257,19,258,19],[257,20,258,20],[270,3,270,16],[260,3,260,16],[260,17,261,17],[260,18,261,18],[260,19,261,19],[241,19,242,19],[241,20,242,20],[242,1,242,2],[242,3,242,16],[243,1,243,2],[243,3,243,16],[244,1,244,2],[244,3,244,16],[244,17,245,17],[244,18,245,18],[244,19,245,19],[244,20,245,20],[245,1,245,2],[245,3,245,16],[246,1,246,2],[247,1,247,2],[247,3,247,16],[251,3,251,16],[255,20,256,20],[237,19,238,19],[225,1,225,2],[225,3,225,16],[225,17,226,17],[225,18,226,18],[225,19,226,19],[225,20,226,20],[226,1,226,2],[226,3,226,16],[227,1,227,2],[227,3,227,16],[237,20,238,20],[238,1,238,2],[238,3,238,16],[232,1,232,2],[232,3,232,16],[232,17,233,17],[232,18,233,18],[232,19,233,19],[232,20,233,20],[233,1,233,2],[233,3,233,16],[234,1,234,2],[234,3,234,16],[234,17,235,17],[234,18,235,18],[234,19,235,19],[234,20,235,20],[235,1,235,2],[235,3,235,16],[236,1,236,2],[236,3,236,16],[212,17,214,17],[212,18,214,18],[212,19,214,19],[212,20,214,20],[214,1,214,2],[214,3,214,16],[221,18,223,18],[221,19,223,19],[221,20,223,20],[223,1,223,2],[223,3,223,16],[215,1,215,2],[215,3,215,16],[215,17,217,17],[215,18,217,18],[215,19,217,19],[215,20,217,20],[217,1,217,2],[217,3,217,16],[218,1,218,2],[218,3,218,16],[218,17,220,17],[218,18,220,18],[218,19,220,19],[218,20,220,20],[220,1,220,2],[220,3,220,16],[216,3,216,16],[219,1,219,2],[219,3,219,16],[213,1,213,2],[212,1,212,2],[206,17,207,17],[206,18,207,18],[206,19,207,19],[206,20,207,20],[207,1,207,2],[207,3,207,16],[210,1,210,2],[210,3,210,16],[200,17,201,17],[200,18,201,18],[200,19,201,19],[200,20,201,20],[202,17,203,17],[202,18,203,18],[202,19,203,19],[202,20,203,20],[208,17,209,17],[208,18,209,18],[208,19,209,19],[208,20,209,20],[210,17,211,17],[210,18,211,18],[210,19,211,19],[210,20,211,20],[204,17,205,17],[211,1,211,2],[211,3,211,16],[204,20,205,20],[43,1,43,2],[54,1,54,2],[44,1,44,2],[45,1,45,2],[24,4,24,20],[44,3,44,16],[45,3,45,16],[47,3,47,16],[46,3,46,16],[212,3,212,16],[200,3,200,16],[201,1,201,2],[201,3,201,16],[202,1,202,2],[202,3,202,16],[203,1,203,2],[203,3,203,16],[204,1,204,2],[204,3,204,16],[199,1,199,2],[199,3,199,16],[195,3,195,20],[193,17,194,17],[193,18,194,18],[193,19,194,19],[193,20,194,20],[196,1,196,2],[196,3,196,16],[197,1,197,2],[197,3,197,16],[204,18,205,18],[204,19,205,19],[32,23,32,24],[28,14,28,16],[29,17,29,20],[30,21,30,22],[10,22,10,24],[11,22,11,24],[12,22,12,24],[16,15,16,24],[17,6,17,7],[15,5,15,24],[17,17,17,24],[16,5,16,12],[17,12,17,14],[37,1,37,11],[14,12,14,19],[10,5,10,16],[12,4,12,16],[13,14,13,16],[13,2,13,10],[14,4,14,9],[32,6,32,13],[32,19,32,21],[27,8,27,10],[42,1,42,11],[37,12,37,15],[38,12,38,15],[39,12,39,15],[40,12,40,15],[37,21,42,24],[36,12,36,15],[36,16,36,20],[41,12,41,15],[42,12,42,15],[37,16,37,20],[38,16,38,20],[39,16,39,20],[40,16,40,20],[41,16,41,20],[42,16,42,20],[38,1,38,11],[39,1,39,11],[40,1,40,11],[41,1,41,11],[53,1,53,2],[49,17,50,17],[49,18,50,18],[49,19,50,19],[49,20,50,20],[52,17,53,17],[52,18,53,18],[52,19,53,19],[52,20,53,20],[45,17,46,17],[45,18,46,18],[45,19,46,19],[45,20,46,20],[47,17,48,17],[47,18,48,18],[47,19,48,19],[47,20,48,20],[50,3,50,16],[53,3,53,16],[51,3,51,16],[52,3,52,16],[49,3,49,16],[47,1,47,2],[49,1,49,2],[51,1,51,2],[52,1,52,2],[50,1,50,2],[48,3,48,16],[61,18,62,18],[61,19,62,19],[61,20,62,20],[62,1,62,2],[62,3,62,16],[60,1,60,2],[60,3,60,16],[61,1,61,2],[61,3,61,16],[61,17,62,17],[58,19,59,19],[58,20,59,20],[59,1,59,2],[59,3,59,16],[44,21,53,24],[55,1,55,2],[55,3,55,16],[55,21,62,24],[56,1,56,2],[56,3,56,16],[56,17,57,17],[56,18,57,18],[56,19,57,19],[56,20,57,20],[57,1,57,2],[57,3,57,16],[58,1,58,2],[58,3,58,16],[58,17,59,17],[58,18,59,18],[46,1,46,2],[48,1,48,2],[64,21,75,24],[65,1,65,2],[65,3,65,16],[65,17,66,17],[65,18,66,18],[65,19,66,19],[65,20,66,20],[66,1,66,2],[66,3,66,16],[71,1,71,2],[71,3,71,16],[71,17,72,17],[71,18,72,18],[71,19,72,19],[71,20,72,20],[72,1,72,2],[72,3,72,16],[67,1,67,2],[67,3,67,16],[67,17,68,17],[67,18,68,18],[67,19,68,19],[63,1,63,2],[64,1,64,2],[64,3,64,16],[74,18,75,18],[74,19,75,19],[74,20,75,20],[75,1,75,2],[75,3,75,16],[73,1,73,2],[73,3,73,16],[74,1,74,2],[74,3,74,16],[74,17,75,17],[67,20,68,20],[68,1,68,2],[68,3,68,16],[69,1,69,2],[69,3,69,16],[69,17,70,17],[69,18,70,18],[69,19,70,19],[69,20,70,20],[70,1,70,2],[70,3,70,16],[80,1,80,2],[80,3,80,16],[80,21,93,24],[81,1,81,2],[81,3,81,16],[81,17,82,17],[81,18,82,18],[81,19,82,19],[77,4,77,24],[78,4,78,24],[79,1,79,2],[81,20,82,20],[82,1,82,2],[82,3,82,16],[83,1,83,2],[83,3,83,16],[83,17,84,17],[83,18,84,18],[83,19,84,19],[83,20,84,20],[84,1,84,2],[84,3,84,16],[85,20,86,20],[86,1,86,2],[97,21,106,24],[100,1,100,2],[100,3,100,16],[100,17,101,17],[100,18,101,18],[87,18,88,18],[87,19,88,19],[87,20,88,20],[88,1,88,2],[88,3,88,16],[92,20,93,20],[93,1,93,2],[93,3,93,16],[95,4,95,24],[92,1,92,2],[92,3,92,16],[92,17,93,17],[92,18,93,18],[92,19,93,19],[91,1,91,2],[91,3,91,16],[89,1,89,2],[89,3,89,16],[89,17,90,17],[89,18,90,18],[89,19,90,19],[89,20,90,20],[90,1,90,2],[90,3,90,16],[87,1,87,2],[87,3,87,16],[87,17,88,17],[101,1,101,2],[101,3,101,16],[102,1,102,2],[102,3,102,16],[102,17,103,17],[102,18,103,18],[102,19,103,19],[102,20,103,20],[103,1,103,2],[103,3,103,16],[96,1,96,2],[97,1,97,2],[97,3,97,16],[96,3,96,19],[85,1,85,2],[85,3,85,16],[85,17,86,17],[85,18,86,18],[85,19,86,19],[86,3,86,16],[113,1,113,2],[113,3,113,16],[113,17,114,17],[113,18,114,18],[136,18,137,18],[136,19,137,19],[136,20,137,20],[137,1,137,2],[137,3,137,16],[135,1,135,2],[135,3,135,16],[136,1,136,2],[105,20,106,20],[106,1,106,2],[106,3,106,16],[98,1,98,2],[98,3,98,16],[98,17,99,17],[98,18,99,18],[98,19,99,19],[98,20,99,20],[99,1,99,2],[99,3,99,16],[105,1,105,2],[105,3,105,16],[105,17,106,17],[105,18,106,18],[105,19,106,19],[104,1,104,2],[104,3,104,16],[100,19,101,19],[100,20,101,20],[107,1,107,2],[108,1,108,2],[108,3,108,16],[109,1,109,2],[109,3,109,16],[109,17,110,17],[109,18,110,18],[109,19,110,19],[109,20,110,20],[110,1,110,2],[110,3,110,16],[111,1,111,2],[111,3,111,16],[111,17,112,17],[111,18,112,18],[111,19,112,19],[111,20,112,20],[112,1,112,2],[112,3,112,16],[136,3,136,16],[136,17,137,17],[113,19,114,19],[113,20,114,20],[114,1,114,2],[114,3,114,16],[115,20,116,20],[116,1,116,2],[116,3,116,16],[117,1,117,2],[117,3,117,16],[117,17,118,17],[117,18,118,18],[117,19,118,19],[117,20,118,20],[118,1,118,2],[118,3,118,16],[115,1,115,2],[115,3,115,16],[115,17,116,17],[115,18,116,18],[115,19,116,19],[133,1,133,2],[119,20,120,20],[120,1,120,2],[120,3,120,16],[121,1,121,2],[121,3,121,16],[121,17,122,17],[121,18,122,18],[121,19,122,19],[121,20,122,20],[122,1,122,2],[122,3,122,16],[119,1,119,2],[119,3,119,16],[119,17,120,17],[119,18,120,18],[119,19,120,19],[133,3,133,16],[133,17,134,17],[133,18,134,18],[133,19,134,19],[133,20,134,20],[134,1,134,2],[134,3,134,16],[129,1,129,2],[129,3,129,16],[129,17,130,17],[129,18,130,18],[129,19,130,19],[125,20,126,20],[126,1,126,2],[126,3,126,16],[123,20,124,20],[124,1,124,2],[124,3,124,16],[131,1,131,2],[131,3,131,16],[131,17,132,17],[131,18,132,18],[131,19,132,19],[131,20,132,20],[132,1,132,2],[132,3,132,16],[123,1,123,2],[123,3,123,16],[123,17,124,17],[123,18,124,18],[123,19,124,19],[129,20,130,20],[130,1,130,2],[130,3,130,16],[127,1,127,2],[127,3,127,16],[127,17,128,17],[127,18,128,18],[127,19,128,19],[127,20,128,20],[128,1,128,2],[128,3,128,16],[125,1,125,2],[125,3,125,16],[125,17,126,17],[125,18,126,18],[125,19,126,19],[138,1,138,2],[138,3,138,16],[144,18,145,18],[144,19,145,19],[144,20,145,20],[145,1,145,2],[145,3,145,16],[143,1,143,2],[143,3,143,16],[144,1,144,2],[144,3,144,16],[144,17,145,17],[139,20,140,20],[140,1,140,2],[140,3,140,16],[141,1,141,2],[141,3,141,16],[141,17,142,17],[141,18,142,18],[141,19,142,19],[141,20,142,20],[142,1,142,2],[142,3,142,16],[139,1,139,2],[139,3,139,16],[139,17,140,17],[139,18,140,18],[139,19,140,19],[168,3,168,16],[168,17,169,17],[168,18,169,18],[168,19,169,19],[168,20,169,20],[169,1,169,2],[169,3,169,16],[170,1,170,2],[170,3,170,16],[171,1,171,2],[171,3,171,16],[171,17,172,17],[148,1,148,2],[148,3,148,16],[148,17,149,17],[148,18,149,18],[148,19,149,19],[148,20,149,20],[149,1,149,2],[149,3,149,16],[152,1,152,2],[152,3,152,16],[152,17,153,17],[152,18,153,18],[150,1,150,2],[150,3,150,16],[150,17,151,17],[150,18,151,18],[150,19,151,19],[150,20,151,20],[151,1,151,2],[151,3,151,16],[153,3,153,16],[158,19,159,19],[158,20,159,20],[159,1,159,2],[159,3,159,16],[156,1,156,2],[156,3,156,16],[156,17,157,17],[156,18,157,18],[156,19,157,19],[156,20,157,20],[157,1,157,2],[157,3,157,16],[146,1,146,2],[147,1,147,2],[147,3,147,16],[167,1,167,2],[167,3,167,16],[162,1,162,2],[162,3,162,16],[158,1,158,2],[158,3,158,16],[158,17,159,17],[158,18,159,18],[160,1,160,2],[160,3,160,16],[152,19,153,19],[152,20,153,20],[153,1,153,2],[160,20,161,20],[161,1,161,2],[161,3,161,16],[171,19,172,19],[171,20,172,20],[172,1,172,2],[172,3,172,16],[154,1,154,2],[154,3,154,16],[154,17,155,17],[154,18,155,18],[154,19,155,19],[154,20,155,20],[155,1,155,2],[155,3,155,16],[166,1,166,2],[166,3,166,16],[166,17,167,17],[166,18,167,18],[166,19,167,19],[166,20,167,20],[163,1,163,2],[163,3,163,16],[163,17,164,17],[163,18,164,18],[163,19,164,19],[163,20,164,20],[164,1,164,2],[164,3,164,16],[165,1,165,2],[165,3,165,16],[160,17,161,17],[160,18,161,18],[160,19,161,19],[168,1,168,2],[173,1,173,2],[174,1,174,2],[174,3,174,16],[186,1,186,2],[186,3,186,16],[175,1,175,2],[175,3,175,16],[175,17,176,17],[175,18,176,18],[175,19,176,19],[175,20,176,20],[176,1,176,2],[176,3,176,16],[178,20,179,20],[179,1,179,2],[179,3,179,16],[185,1,185,2],[185,3,185,16],[186,17,187,17],[186,18,187,18],[186,19,187,19],[178,1,178,2],[178,3,178,16],[178,17,179,17],[178,18,179,18],[178,19,179,19],[186,20,187,20],[187,1,187,2],[183,18,184,18],[183,19,184,19],[183,20,184,20],[184,1,184,2],[171,18,172,18],[180,1,180,2],[180,3,180,16],[177,1,177,2],[177,3,177,16],[290,1,290,2],[290,3,290,16],[290,17,291,17],[290,18,291,18],[290,19,291,19],[290,20,291,20],[291,1,291,2],[291,3,291,16],[294,1,294,2],[294,3,294,16],[299,1,299,2],[299,3,299,16],[299,17,300,17],[189,4,189,24],[190,4,190,24],[181,1,181,2],[181,3,181,16],[181,17,182,17],[181,18,182,18],[181,19,182,19],[181,20,182,20],[182,1,182,2],[182,3,182,16],[183,1,183,2],[183,3,183,16],[183,17,184,17],[208,1,208,2],[184,3,184,16],[292,1,292,2],[292,3,292,16],[292,17,293,17],[292,18,293,18],[292,19,293,19],[292,20,293,20],[293,1,293,2],[293,3,293,16],[295,1,295,2],[295,3,295,16],[295,17,296,17],[301,1,301,2],[301,3,301,20],[285,1,285,2],[285,3,285,16],[187,3,187,16],[208,3,208,16],[209,1,209,2],[209,3,209,16],[191,1,191,2],[192,1,192,2],[192,3,192,16],[193,1,193,2],[193,3,193,16],[195,1,195,2],[194,3,194,16],[200,1,200,2],[205,1,205,2],[205,3,205,16],[206,1,206,2],[206,3,206,16],[285,21,300,24],[286,1,286,2],[286,3,286,16],[286,17,287,17],[286,18,287,18],[286,19,287,19],[286,20,287,20],[287,1,287,2],[287,3,287,16],[288,1,288,2],[288,3,288,16],[288,17,289,17],[288,18,289,18],[288,19,289,19],[288,20,289,20],[289,1,289,2],[289,3,289,16],[302,1,302,2],[302,3,302,16],[303,1,303,2],[303,3,303,16],[303,17,304,17],[303,18,304,18],[303,19,304,19],[303,20,304,20],[304,1,304,2],[304,3,304,16],[295,18,296,18],[295,19,296,19],[295,20,296,20],[296,1,296,2],[296,3,296,16],[297,1,297,2],[297,3,297,16],[297,17,298,17],[297,18,298,18],[297,19,298,19],[297,20,298,20],[298,1,298,2],[298,3,298,16],[299,18,300,18],[299,19,300,19],[299,20,300,20],[300,1,300,2],[300,3,300,16],[308,1,308,2],[308,3,308,16],[308,17,309,17],[308,18,309,18],[308,19,309,19],[308,20,309,20],[309,1,309,2],[309,3,309,16],[310,1,310,2],[310,3,310,16],[307,1,307,2],[307,3,307,16],[305,1,305,2],[305,3,305,16],[305,17,306,17],[305,18,306,18],[305,19,306,19],[305,20,306,20],[306,1,306,2],[306,3,306,16],[319,1,319,2],[319,3,319,16],[315,1,315,2],[315,3,315,16],[315,17,316,17],[315,18,316,18],[315,19,316,19],[315,20,316,20],[316,1,316,2],[316,3,316,16],[311,1,311,2],[311,3,311,16],[311,17,312,17],[311,18,312,18],[311,19,312,19],[311,20,312,20],[312,1,312,2],[312,3,312,16],[313,1,313,2],[313,3,313,16],[313,17,314,17],[313,18,314,18],[313,19,314,19],[313,20,314,20],[314,1,314,2],[314,3,314,16],[302,21,319,24],[320,1,320,2],[321,1,321,2],[321,3,321,16],[321,21,349,24],[322,1,322,2],[322,3,322,16],[322,17,324,17],[322,18,324,18],[322,19,324,19],[322,20,324,20],[324,1,324,2],[324,3,324,16],[325,1,325,2],[325,3,325,16],[325,17,326,17],[325,18,326,18],[325,19,326,19],[325,20,326,20],[326,1,326,2],[326,3,326,16],[327,1,327,2]],"merged_total":1243,"flags":["merged_cut"]}
[null,null,null,null,null,null,null,null,null,null,null,null,null,null,null,null,null,null,null,null,null,null,null,null,"Feedlot inspection checklist"]
[null,null,null,null,null,null,null,null,null,null,null,null,null,null,null,null,null,null,null,null,null,null,null,null,"Feedlot Program"]
[null,null,null,null,null,null,null,null,null,null,null,null,null,null,null,null,null,null,null,null,null,null,null,null,"National Pollutant Discharge Elimination System/"]
[null,null,null,null,null,null,null,null,null,null,null,null,null,null,null,null,null,null,null,null,null,null,null,null,"State Disposal System (NPDES/SDS)"]
[null,null,null,null,null,null,null,null,null,null,null,null,null,null,null,null,null,null,null,null,null,null,null,null,"Doc Type:  Inspection"]
[null,null,null,null,null,null,null,null,null,null,null,null,null,null,null,null,null,null,null,null,null,null,null,null,"wq-f3-45e (Revised 6/18/20)"]
[null,"Instructions:",null,null,null,"Use this form to evaluate a feedlot’s compliance with Minnesota feedlot rules, statutes, and permit conditions. \nA list of acronyms is included within the key of this checklist."]
[null,"Documentation after completion of inspection:"]
[null,"·       Send a letter to the feedlot owner and enclose checklist section(s) where non-compliance was identified."]
[null,"Facility information"]
[null,"Facility name:",null,null,null,"     ",null,null,null,null,null,null,null,null,null,null,null,null,null,null,null,"Registration number:",null,null,null,null,null,null,null,null,null,null,null,null,null,null,null,null,"     "]
[null,null,null,"The feedlot is Ag Water Quality Certified.",null,null,null,null,null,null,null,null,null,null,null,null,null,null,null,null,null,"AI ID number:",null,null,null,null,null,null,null,null,null,null,null,null,null,null,null,null,"     "]
[null,"Address:",null,null,"      ",null,null,null,null,null,null,null,null,null,null,null,null,null,null,null,null,"County ID number:",null,null,null,null,null,null,null,null,null,null,null,null,null,null,null,null,"     "]
[null,"City:","     ",null,null,null,null,null,null,null,null,"State:",null,"Zip:",null,null,null,null,null,null,null,null,null,null,null,"     ",null,null,null,null,"     "]
[null,"County:  ",null,null,null,null,null,null,null,null,null,"Township:",null,null,null,null,null,null,null,null,null,"Section:",null,"Qtr:","     ",null,null,null,null,null,null,null,null,null,null,null,null,"     "]
[null,"Parcel ID no:",null,null,null,"     "]
[null,"Owner name:",null,null,null,"     ",null,null,null,null,null,null,null,null,"Operator:"]
[null,"Primary phone:",null,null,null,null,null,null,null,null,null,"Secondary phone:",null,null,null,null,"Email:","     ",null,null,null,null,null,null,null,null,null,null,null,null,null,"     "]
[]
[null,"A MinnFarm or FLEval exists for the feedlot.",null,null,null,null,null,null,null,null,null,null,null,null,null,null,null,null,null,null,null,null,false,null,false]
[null,"The feedlot is located in a Drinking Water Supply Management Area.",null,null,null,null,null,null,null,null,null,null,null,null,null,null,null,null,null,null,null,null,false,null,false]
[null,"The feedlot is located in shoreland.",null,null,null,null,null,null,null,null,null,null,null,null,null,null,null,null,null,null,null,null,false,null,false]
[null,"The feedlot is enrolled in the Open Lot Agreement.",null,null,null,null,null,null,null,null,null,null,null,null,null,null,null,null,null,null,null,null,false,null,false]
[null,"The site meets or exceeds the large CAFO threshold or 1,000 animal units",null,null,null,null,null,null,null,null,null,null,null,null,null,null,null,null,null,null,null,null,false,true,false]
[null,null,null,"Note:","You must also include the maximum capacity of any other commonly owned feedlots adjacent to or within ¼ mile of this feedlot when making this determination.  (see MPCA Multi-site policy)",null,null,null,null,null,null,null,null,null,null,null,null,null,null,null,null,null,null,false]
[null,"* If Yes, MPCA staff must conduct inspections and permitting",null,null,null,null,null,null,null,null,null,null,null,null,null,null,null,null,null,null,null,null,false,false]
[null,"Recent activity",null,null,null,null,null,null,null,null,null,null,null,null,null,null,null,null,null,null,null,null,false,false,false]
[null,"Date of most recent registration:",null,null,null,null,null,null,null,null,null,"     ",null,null,null,null,null,null,null,null,null,null,true,false,false]
[null,"Most recent inspection:",null,null,null,null,null,null,null,null,null,null,null,"Date:",null,null,null,null,null,"Result:"]
[null,"Current permit type:",null,null,null,null,null,false,false,null,null,null,null,null,null,null,"Expiration date:",null,null,null,null,null,null,null,"     "]
[null,"Most recent enforcement type:",null,null,null,null,null,null,null,null,null,null,null,null,null,null,null,null,null,null,"Issuance date:",null,null,null,null,null,null,null,"     "]
[null,"Current inspection information"]
[null,"Inspector name:",null,null,null,null,null,null,null,null,null,null,null,null,null,null,null,null,"Insepction date:",null,null,null,"Time: ","     "]
[null,"Others present:"]
[null,"Types of inspection(s):",null,null,null,null,null,"Facility compliance (includes N)",null,null,null,null,null," include optional P review in the compliance inspection"]
[null,"(check all that apply)",null,null,null,null,null,"Desktop N & P records review",null,null,null,null,null,null,"In field land application",null,null,null,null,null,null,null,"Stockpile only"]
[null,"Animal types",null,null,null,null,null,null,null,null,null,null,"Registered number",null,null,null,"On-site number",null,null,null,null,"Notes"]
[]
[]
[]
[]
[]
[]
[1,"1.",null,"Expansion and stocking requirements",null,null,null,null,null,null,null,null,null,null,null,null,null,null,null,null,null,"Notes:"]
[null,null,null,"Checklist questions",null,null,null,null,null,null,null,null,null,null,null,null,null,"C","NC","NA","NI"]
["C","1.1. ",null,"Facility registration is current (date within previous 4-year block)."]
[null,null,null,"(7020.0350 Subp. 4.)"]
["C","1.2. ",null,"Animal units and animal species, (types and numbers) matches the most recent registration or authorization (i.e. permit, notice of construction, change of ownership, termination) AND animal holding areas and manure storage areas match the most recent permit, Notice of Construction or Expansion, MinnFarm or inspection. "]
[null,null,null,"(7020.0405, supb. 2. & 5., 7020.2000 Subp. 5.)"]
["N","1.3. ",null,"NPDES/SDS - Feed storage area(s) have not been constructed or expanded unless authorized by permit. "]
[null,null,null,"(NPDES/SDS Part 5.6.1.2.)"]
[1.2,null,null,"Inspection requirement",null,null,null,null,null,null,null,null,null,null,null,null,null,"C","NC","NA","NI"]
["I","1.4. ",null,"Construction or expansion requirements are met.  "]
[null,null,null,"(7020.0405, supb. 2. & 5., 7020.0350 subp 4, 7020.2000 Subp. 5., NPDES/SDS Parts 5.6.1.2. & 11.)"]
[2,"2.",null,"Animal confinement barn(s)",null,null,null,null,null,null,null,null,null,null,null,null,null,null,null,null,null,"Notes:"]
[null,null,null,"Checklist questions",null,null,null,null,null,null,null,null,null,null,null,null,null,"C","NC","NA","NI"]
["C","2.1.",null,"There is evidence (e.g., inadequate buffer, steep slopes, channels, matted or dead vegetation, clean water run-on, stormwater flow) that manure seepage from barn(s) reaches waters of the state or tile intakes, sinkholes, fractured bedrock, well, mine or quarry. "]
[null,null,null,"(7020.2003, subp. 1. & 3., 7050.0210, subp. 2. & 13., Specific to NPDES/SDS 7020.2003, subp. 2.)"]
["C","2.2.",null,"There is evidence (e.g., ponding, coarse-textured soils, depth to water table) that manure seepage from barn(s) could impact ground water. "]
[null,null,null,"(7020.2003, subp. 1., 7050.0210, subp. 2. & 13., 7060.0600, subp. 2.)"]
[2.2000000000000002,null,null,"Inspection requirement",null,null,null,null,null,null,null,null,null,null,null,null,null,"C","NC","NA","NI"]
["I","2.3.",null,"Confinement barn discharge requirements are met. "]
[null,null,null,"(7020.2003, subp. 1. & 3., 7050.0210, subp. 2. & 13., 7060.0600, subp. 2., NPDES or SDS permit)"]
[3,"3.",null,"Open lot(s)",null,null,null,null,null,null,null,null,null,null,null,null,null,null,null,null,null,"Notes:"]
[null,null,null,"Checklist questions",null,null,null,null,null,null,null,null,null,null,null,null,null,"C","NC","NA","NI"]
["C","3.1.",null,"Animals do not have access to a lake classified by the Minnesota Department of Natural Resources (DNR). "]
[null,null,null,"(7020.2015, subp. 2, 7050.0210, subp. 2 & 13, 7060.0600, subp. 2.)"]
["C","3.2.",null,"There is evidence (e.g., inadequate buffer, steep slopes, channels, matted or dead vegetation, clean water run-on, stormwater flow) that open lot runoff reaches waters of the state or tile intakes, sinkholes, fractured bedrock, well, mine or quarry. "]
[null,null,null,"(7020.2003, subp. 1. & 3., 7050.0210, subp. 2. & 13., Specific to NPDES/SDS 7020.2003, subp. 2.)"]
["C","3.3.",null,"There is evidence (e.g., ponding, coarse-textured soils, depth to water table) that open lot runoff could impact ground water. "]
[null,null,null,"(7020.2003, subp. 1., 7050.0210, subp. 2. & 13., 7060.0600, subp. 2.)"]
["N","3.4.",null,"NPDES/SDS - Runoff from open lot is contained in an approved structure or system. "]
[null,null,null,"(NPDES/SDS Parts 2. & 3.2, 7050.0210, subp. 2 & 13, 7060.0600, subp. 2)"]
[3.2,null,null,"Inspection requirement",null,null,null,null,null,null,null,null,null,null,null,null,null,"C","NC","NA","NI"]
["I","3.5.",null,"Open lot discharge requirements are met.   "]
[null,null,null,"(7020.2003, subp. 1. & 3., 7050.0210, subp. 2. & 13., 7060.0600, subp. 2., NPDES or SDS permit)"]
[null,null,null,"Additional considerations:"]
[null,null,null,"·","Where runoff controls/treatment (i.e. clean water diversions,  solid setting areas, vegetative buffers) were part of the original permit approval for the site or necessary for open lot compliance, are runoff controls/treatment operational and being maintained (O&M)?"]
[null,null,null,"·","If the site is non-compliant, is the Owner currently signed up for cost share? [3/6/09 Memorandum of Understanding (MOU)-MPCA, Minnesota Department of Agriculture (MDA), Board of Water and Soil Resources (BWSR)]"]
[4,"4.",null,"Feed storage area(s)",null,null,null,null,null,null,null,null,null,null,null,null,null,null,null,null,null,"Notes:"]
[null,null,null,"Checklist questions",null,null,null,null,null,null,null,null,null,null,null,null,null,"C","NC","NA","NI"]
["C","4.1.",null,"There is evidence (e.g., inadequate buffer, steep slopes, channels, matted or dead vegetation, clean water run-on, stormwater flow) that feed storage area runoff reaches waters of the state or tile intakes, sinkholes, fractured bedrock, well, mine or quarry. "]
[null,null,null,"(7020.2003, subp. 1. & 3., 7050.0210, subp. 2. & 13., Specific to NPDES/SDS 7020.2003, subp. 2.)"]
["C","4.2.",null,"There is evidence (e.g., ponding, coarse-textured soils, depth to water table) that the feed storage area could impact ground water. "]
[null,null,null,"(7020.2003, subp. 1., 7050.0210, subp. 2. & 13., 7060.0600, subp. 2.)"]
["N","4.3.",null,"NPDES/SDS - Manure is not stored on the feed storage area pad unless the storage is part of the approved design. "]
[null,null,null,"(NPDES/SDS Part 3.5, 7050.0210, subp. 2 & 13, 7060.0600, subp. 2)"]
["N","4.4.",null,"NPDES/SDS - Feed storage area leachate and runoff is contained in an approved structure or system."]
[null,null,null,"(NPDES/SDS Part 3.5.2.)"]
["N","4.5.",null,"NPDES/SDS - If leachate and feed storage area runoff is managed with a VIB, operation and maintenance activities are performed as required by permit."]
[null,null,null,"(NPDES/SDS Parts 3.5.2.2.) "]
[4.2,null,null,"Inspection requirement",null,null,null,null,null,null,null,null,null,null,null,null,null,"C","NC","NA","NI"]
["I","4.6.",null,"Feed storage area discharge requirements are met. "]
[null,null,null,"(7020.2003, subp. 1. & 3., 7050.0210, subp. 2. & 13., 7060.0600, subp. 2., NPDES or SDS permit)"]
[null,null,null,"Additional considerations:"]
[null,null,null,"·","If the site stores 1,000 tons or more of sweet corn silage stored on site at any one time and does not have an NPDES or SDS permit, the site should be referred to MPCA staff."]
[5,"5._",null,"Process wastewater handling system(s)\n(milk house wastewater / egg wash / truck wash)",null,null,null,null,null,null,null,null,null,null,null,null,null,null,null,null,null,"Notes:"]
[null,null,null,"Checklist questions",null,null,null,null,null,null,null,null,null,null,null,null,null,"C","NC","NA","NI"]
["N","5.1.",null,"NPDES/SDS - Process wastewater from the facility is contained in an approved structure or system."]
[null,null,null,"(NPDES/SDS Parts 2. & 3.2.)"]
["C","5.2.",null,"There is evidence (e.g., inadequate buffer, steep slopes, channels, matted or dead vegetation, clean water run-on, stormwater flow) that process wastewater reaches waters of the state or tile intakes, sinkholes, fractured bedrock, well, mine or quarry. "]
[null,null,null,"(7020.2003, subp. 1. & 3., 7050.0210, subp. 2. & 13., Specific to NPDES/SDS 7020.2003, subp. 2.)"]
["C","5.3.",null,"There is evidence (e.g., ponding, coarse-textured soils, depth to water table) that process wastewater could impact ground water. "]
[null,null,null,"(7020.2003, subp. 1., 7050.0210, subp. 2. & 13., 7060.0600, subp. 2.)"]
[5.2,null,null,"Inspection requirement",null,null,null,null,null,null,null,null,null,null,null,null,null,"C","NC","NA","NI"]
["I","5.4.",null,"Process wastewater (milk house wastewater / egg wash / truck wash) discharge requirements are met. "]
[null,null,null,"(7020.2003, subp. 1. & 3., 7050.0210, subp. 2. & 13., 7060.0600, subp. 2., NPDES or SDS permit)"]
[6,"6.",null,"Short-term manure stockpile site(s)",null,null,null,null,null,null,null,null,null,null,null,null,null,null,null,null,null,"Notes:"]
[null,null,null,"Technical checklist questions",null,null,null,null,null,null,null,null,null,null,null,null,null,"C","NC","NA","NI"]
["C","6.1.",null,"The required location prohibitions for short-term manure stockpiles are met (shoreland, flood plain, sinkhole and wells)."]
[null,null,null,"(7020.2005 Subp. 1, 7050.0210, subp. 2 & 13, 7060.0600, subp. 2)"]
["C","6.2.",null,"The required 50’ horizontal and 300’ flow distance to surface water and road ditches are met."]
[null,null,null,"(7020.2125 Subp 2. C.)"]
["C","6.3.",null,"The nearest well is at least 100’ away if the well is cased, or at least 200’ if it is not cased."]
[null,null,null,"[7020.2125 Subp 2. C. (4)]"]
["C","6.4.",null,"The short-term manure stockpile is located on slopes less than 6%."]
[null,null,null,"[7020.2125 Subp 2. E. (1)]"]
["C","6.5.",null,"There is at least a 2’ separation between the short-term manure stockpile and the seasonal high water table. "]
[null,null,null,"(7020.2125 Subp 2. D.)"]
["C","6.6.",null,"Soils at the short-term stockpile site are sandy loam or finer in the top 5’. "]
[null,null,null,"[7020.2125 Subp 2. E. (3)]"]
["C","6.7.",null,"Rock quarry(s), gravel or sand pit(s), bedrock, or any mining excavation site(s) are not used for the short-term manure stockpile site."]
[null,null,null,"(7020.2125 Subp 1. C.)"]
["C","6.8.",null,"The manure in the short-term stockpile can be stacked with slopes of at least 3:1 and contains at least 15% solids. "]
[null,null,null,"(7020.2125 Subp 1. B.)"]
["C","6.9.",null,"The volume of short-term stockpiled manure is less than 320 acres \nbased on N. "]
[null,null,null,"(7020.2125 Subp 1. D.)"]
["C","6.10.",null,"Clean water diversions are in place and operational on short-term manure stockpile sites with a slope of 2-6%."]
[null,null,null,"[7020.2125 Subp 2. E. (2)]"]
["C","6.11.",null,"All manure is removed from the short-term stockpile site within 1 year. "]
[null,null,null,"(7020.2125 Subp 2. A.)"]
["C","6.12.",null,"Vegetation is re-established for 1 growing season prior to site re-use as a short-term stockpile site. "]
[null,null,null,"(7020.2125 Subp 2. B.)"]
["C","6.13.",null,"Records for short-term manure stockpiles are maintained and kept on file for the recent 3 year period."]
[null,null,null,"(7020.2125 Subp 3.)"]
[6.2,null,null,"Technical inspection requirement",null,null,null,null,null,null,null,null,null,null,null,null,null,"C","NC","NA","NI"]
["I","6.14.",null,"Short-term stockpile site technical requirements are met. "]
[null,null,null,"(7020.2125, subp. 1, 2 & 3)"]
[null,null,null,"Discharge checklist questions",null,null,null,null,null,null,null,null,null,null,null,null,null,"C","NC","NA","NI"]
["C","6.15.",null,"There is evidence (e.g., inadequate buffer, steep slopes, channels, matted or dead vegetation, clean water run-on, stormwater flow) that runoff from the short-term stockpile reaches waters of the state or tile intakes, sinkholes, fractured bedrock, well, mine or quarry. "]
[null,null,null,"(7020.2003, subp. 1. & 3., 7050.0210, subp. 2. & 13., Specific to NPDES/SDS 7020.2003, subp. 2.)"]
["C","6.16.",null,"There is evidence (e.g., ponding, coarse-textured soils, depth to water table) that the short-term stockpile could impact ground water. "]
[null,null,null,"(7020.2003, subp. 1., 7050.0210, subp. 2. & 13., 7060.0600, subp. 2.)"]
[6.4,null,null,"Discharge inspection requirement",null,null,null,null,null,null,null,null,null,null,null,null,null,"C","NC","NA","NI"]
["I","6.17.",null,"Short-term stockpile site(s) discharge requirements are met.   "]
[null,null,null,"(7020.2003, subp. 1. & 3., 7050.0210, subp. 2. & 13., 7060.0600, subp. 2., NPDES or SDS permit)"]
[7,"7.",null,"Permanent manure stockpile site(s)",null,null,null,null,null,null,null,null,null,null,null,null,null,null,null,null,null,"Notes:"]
[null,null,null,"Technical checklist questions",null,null,null,null,null,null,null,null,null,null,null,null,null,"C","NC","NA","NI"]
["C","7.1.",null,"The required location prohibitions for permanent manure stockpiles are met (shoreland, flood plain, sinkhole and wells)."]
[null,null,null,"(7020.2005 Subp. 1.)"]
["C","7.2.",null,"Rock quarry(s), gravel or sand pit(s), bedrock, or any mining excavation site(s) are not used for the permanent stockpile site."]
[null,null,null,"(7020.2125 Subp 1. C.)"]
["C","7.3.",null,"The permanent manure stockpile is located on an impervious pad."]
[null,null,null,"(7020.2125 Subp 4. B.)"]
["C","7.4.",null,"Upslope clean water diversions are present if slopes are greater than 2%."]
[null,null,null,"(7020.2125 Subp 4. C.)"]
["C","7.5.",null,"Runoff from the permanent manure stockpile site is managed adequately.\nFor example: vegetative treatment, settling basins, LMSAs, cropped fields, etc. (containment is required for NPDES/SDS sites)"]
[null,null,null,"(7020.2125 Subp. 4.)"]
["C","7.6.",null,"The permanent manure stockpile runoff system is maintained and operating properly."]
[null,null,null,"(7020.2125 Subp. 4. D.)"]
["C","7.7.",null,"The manure stockpile is stacked at slopes of at least 3:1 and contains at least 15% solids. "]
[null,null,null,"(7020.2125 Subp 1. B.)"]
[7.2,null,null,"Technical inspection requirement",null,null,null,null,null,null,null,null,null,null,null,null,null,"C","NC","NA","NI"]
["I","7.8.",null,"Permanent stockpile site technical requirements are met. "]
[null,null,null,"(7020.2125, subp. 1 & 4, 7020.2005 subp. 1)"]
[null,null,null,"Discharge checklist questions",null,null,null,null,null,null,null,null,null,null,null,null,null,"C","NC","NA","NI"]
["C","7.9.",null,"There is evidence (e.g., inadequate buffer, steep slopes, channels, matted or dead vegetation, clean water run-on, stormwater flow) that runoff from the permanent stockpile reaches waters of the state or tile intakes, sinkholes, fractured bedrock, well, mine or quarry. "]
[null,null,null,"(7020.2003, subp. 1. & 3., 7050.0210, subp. 2. & 13., Specific to NPDES/SDS 7020.2003, subp. 2.)"]
["C","7.10.",null,"There is evidence (e.g., ponding, coarse-textured soils, depth to water table) that the permenant stockpile could impact ground water. "]
[null,null,null,"(7020.2003, subp. 1., 7050.0210, subp. 2. & 13., 7060.0600, subp. 2.)"]
[7.4,null,null,"Discharge inspection requirement",null,null,null,null,null,null,null,null,null,null,null,null,null,"C","NC","NA","NI"]
["I","7.11.",null,"Permanent stockpile site discharge requirements are met.   "]
[null,null,null,"(7020.2003, subp. 1. & 3., 7050.0210, subp. 2. & 13., 7060.0600, subp. 2., NPDES or SDS permit)"]
[8,"8.",null,"Manure compost site(s)",null,null,null,null,null,null,null,null,null,null,null,null,null,null,null,null,null,"Notes:"]
[null,null,null,"Technical checklist questions",null,null,null,null,null,null,null,null,null,null,null,null,null,"C","NC","NA","NI"]
["C","8.1.",null,"The site meets the technical manure composting requirements (e.g., clean water diversions, pathogen reduction, record keeping). If not, evaluate the site as a manure stockpile site."]
[null,null,null,"(7020.2150, subp. 2 & 3)"]
[8.1999999999999993,null,null,"Technical inspection requirement",null,null,null,null,null,null,null,null,null,null,null,null,null,"C","NC","NA","NI"]
["I","8.2.",null,"Manure compost site technical requirements are met. "]
[null,null,null,"(7020.2150)"]
[null,null,null,"Discharge checklist questions",null,null,null,null,null,null,null,null,null,null,null,null,null,"C","NC","NA","NI"]
["C","8.3.",null,"There is evidence (e.g., inadequate buffer, steep slopes, channels, matted or dead vegetation, clean water run-on, stormwater flow) that runoff from the manure compost reaches waters of the state or tile intakes, sinkholes, fractured bedrock, well, mine or quarry. "]
[null,null,null,"(7020.2003, subp. 1. & 3., 7050.0210, subp. 2. & 13., Specific to NPDES/SDS 7020.2003, subp. 2.)"]
["C","8.4.",null,"There is evidence (e.g., ponding, coarse-textured soils, depth to water table) that the manure compost site could impact ground water. "]
[null,null,null,"(7020.2003, subp. 1., 7050.0210, subp. 2. & 13., 7060.0600, subp. 2.)"]
[8.4,null,null,"Discharge inspection requirement",null,null,null,null,null,null,null,null,null,null,null,null,null,"C","NC","NA","NI"]
["I","8.5.",null,"Manure compost site discharge requirements are met.   "]
[null,null,null,"(7020.2003, subp. 1. & 3., 7050.0210, subp. 2. & 13., 7060.0600, subp. 2., NPDES or SDS permit)"]
[null,null,null,"Additional considerations: If the manure compost site contains:"]
[null,null,null,"·","Dead animals (refer to Board of Animal Health)"]
[null,null,null,"·","Solid waste (refer to solid waste staff)"]
[9,"9.",null,"Liquid manure storage area(s) (LMSA)",null,null,null,null,null,null,null,null,null,null,null,null,null,null,null,null,null,"Notes:"]
[null,null,null,"Checklist questions (LMSA permitting, certification, or approval)",null,null,null,null,null,null,null,null,null,null,null,null,null,"C","NC","NA","NI"]
["C","9.1.",null,"All LMSA(s) at the site have been permitted, previously certified or previously approved. "]
[null,null,null,"(7020.0405, 7020.2110 Subp. 4. & 5., 7020.2100 Subp. 4., 7020.2000 Subp. 5.)"]
[null,null,null,"For any LMSA(s) that are not permitted, previously certified, or previously approved;\n- Unpermitted / unapproved LMSA(s) constructed BEFORE 10-23-2000 must obtain an approval to continue to operate the LMSA (see 7020.2110 Subp. 5.).\n- Unpermitted / unapproved LMSA(s) constructed AFTER 10-23-2000 are NOT ALLOWED (see 7020.2110 Subp. 4. & 5.).\nRequire Corrective Actions (closure or submittal of information identified in 7020.2110 Subp.5.) when an LMSA is not permitted, previously certified or previously approved.\n"]
[9.1999999999999993,null,null,"Inspection requirement",null,null,null,null,null,null,null,null,null,null,null,null,null,"C","NC","NA","NI"]
["I","9.2.",null,"LMSA permitting, certification or approval requirements are met."]
[null,null,null,"(7020.0405, 7020.2110 Subp. 4. & 5.,  7020.2100 Subp. 4., 7020.2000 Subp. 5. )"]
[null,null,null,"Checklist questions (all LMSA technical requirements)",null,null,null,null,null,null,null,null,null,null,null,null,null,"C","NC","NA","NI"]
["C","9.3.",null,"Design Freeboard capacity is maintained. "]
[null,null,null,"(7020.2100 Subp. 4. D.)"]
["C","9.4.",null,"For LMSA(s) where a modification is identified: The modification to the LMSA(s) was approved before the modification was made. "]
[null,null,null,"(7020.2100 Subp. 4., 7020.0405)"]
["C","9.5.",null,"Unless otherwise approved, only manure and process wastewater is stored in the LMSA. "]
[null,null,null,"(7020.0205 I.)"]
["C","9.6.",null,"For LMSA(s) NOT under a barn: There is a perimeter fence, or  berms/sidewalls at least 5’ tall. "]
[null,null,null,"(7020.0205 I.)"]
["C","9.7.",null,"For LMSA(s) with a cover: the cover of the LMSA is properly maintained. "]
[null,null,null,"(7020.2100 Subp. 7.)"]
["N","9.8.",null,"NPDES/SDS - For open-air LMSAs the Permittee has installed and maintains a visual marker that indicates the freeboard of the LMSA.\nFor covered LMSAs, including those that are below a barn, the Permittee has developed and employs a system to measure and monitor the liquid level in the LMSA so that the freeboard is maintained. "]
[null,null,null,"(NPDES/SDS Parts 5.2.2. & 5.2.2.1.)"]
["C","9.9.",null,"The earthen LMSA is being operated and maintained properly and in accordance with the design plans."]
[null,null,null,"Examples of common issues are below:\n- Damage to LMSA sidewalls (ruts or erosion rills greater than or equal to 6” deep in the liner)\n- Liner slumping or sloughing\n- Damage to agitation pad(s) and/or splash guard(s) \n- Deep-rooted vegetation or rodent activities in or near the LMSA.\n- Perimeter tile system (if present) appears to be in need of repair."]
[null,null,null,"(7020.2100 Subp. 7.)"]
["C","9.10.",null,"The synthetic (plastic) LMSA is being operated and maintained properly and in accordance with the design plans.  "]
[null,null,null,"Examples of common issues are below.\n- tears, bubbles, or other signs of damage to the synthetic liner\n- gas venting system (if present) appears to be in disrepair\n- deep-rooted vegetation or rodent activities in or near the LMSA.\n- Perimeter tile system (if present) appears to be in need of repair."]
[null,null,null,"(7020.2100 Subp. 7.)"]
["C","9.11.",null,"The concrete LMSA is being operated and maintained properly and in accordance with the design plans."]
[null,null,null," Examples of common issues are below.\n- Cracks, exposed rebar or other defects in that concrete needing repair\n- Pumpouts are not firmly attached to the pit walls and covered.\n- deep-rooted vegetation or rodent activities in or near the LMSA.\n- Perimeter tile system (if present) appears to be in need of repair."]
[null,null,null,"(7020.2100 Subp. 7.)"]
["C","9.12.",null,"The above ground LMSA (\"slurry store\") is being operated and maintained properly and in accordance with the design plans."]
[null,null,null," Examples of common issues are below.\n- Manure transfer valve or backflow prevention devices appear to need maintenance.\n- Separation of concrete base from wall panels"]
[null,null,null,"(7020.2100 Subp. 7.)"]
[9.4,null,null,"Technical inspection requirement",null,null,null,null,null,null,null,null,null,null,null,null,null,"C","NC","NA","NI"]
["I","9.13.",null,"LMSA technical requirements are met. "]
[null,null,null,"(7020.2100, 7020.0405, 7020.0205, NPDES or SDS permit) "]
[null,null,null,"Discharge checklist questions",null,null,null,null,null,null,null,null,null,null,null,null,null,"C","NC","NA","NI"]
["C","9.14.",null,"There is evidence of manure contaminated water in the perimeter tile (where perimeter tile is present)."]
[null,null,null,"(7020.2003, subp. 1 & 3, 7050.0210, subp. 2 & 13, 7060.0600, subp. 2, CAFO/1000 AU specific - 7020.2003, subp. 2., NPDES/SDS Part 10.4)"]
["C","9.15.",null,"There is evidence of an overflow or a discharge from the LMSA(s)."]
[null,null,null,"(7020.2003, subp. 1 & 3, 7050.0210, subp. 2 & 13, 7060.0600, subp. 2, CAFO/1000 AU specific - 7020.2003, subp. 2., NPDES/SDS Part 10.2.)"]
["C","9.16.",null,"There is evidence (e.g., inadequate buffer, steep slopes, channels, matted or dead vegetation, clean water run-on, stormwater flow) that the overflow/discharge from the LMSA(s) reached waters of the state or tile intakes, sinkholes, fractured bedrock, well, mine or quarry. "]
[null,null,null,"(7020.2003, subp. 1 & 3, 7050.0210, subp. 2 & 13, 7060.0600, subp. 2, CAFO/1000 AU specific - 7020.2003, subp. 2., NPDES/SDS Part 10.2.)"]
["C","9.17.",null,"There is evidence (e.g., ponding, coarse-textured soils, depth to water table) that the overflow/discharge from the LMSA could impact ground water. "]
[null,null,null,"(7020.2003, subp. 1 & 3, 7050.0210, subp. 2 & 13, 7060.0600, subp. 2, CAFO/1000 AU specific - 7020.2003, subp. 2., NPDES/SDS Part 10.2.)"]
[9.6,null,null,"Discharge inspection requirement",null,null,null,null,null,null,null,null,null,null,null,null,null,"C","NC","NA","NI"]
["I","9.18.",null,"LMSA discharge requirements are met.   "]
[null,null,null,"(7020.2003, subp. 1 & 3, 7050.0210, subp. 2 & 13, 7060.0600, subp. 2, CAFO/1000 AU specific - 7020.2003, subp. 2., NPDES/SDS Part 10.2.)"]
[10,"10.",null,"Poultry barn floor(s)",null,null,null,null,null,null,null,null,null,null,null,null,null,null,null,null,null,"Notes:"]
[null,null,null,"Checklist question",null,null,null,null,null,null,null,null,null,null,null,null,null,"C","NC","NA","NI"]
["C","10.1.",null,"The poultry barn floors are properly maintained (e.g., no cracks, saturated spots, holes or divots in the liner)"]
[null,null,null,"(7020.2000 Subp. 1., 7020.2120)"]
[10.199999999999999,null,null,"Inspection requirement",null,null,null,null,null,null,null,null,null,null,null,null,null,"C","NC","NA","NI"]
["I","10.2.",null,"Poultry barn floor requirements are met.   "]
[null,null,null,"(7020.2003, subp. 1 & 3, 7050.0210, subp. 2 & 13, 7060.0600, subp. 2, CAFO/1000 AU specific - 7020.2003, subp. 2., NPDES/SDS Part 10.2.)"]
[11,"11.",null,"Mortality management",null,null,null,null,null,null,null,null,null,null,null,null,null,null,null,null,null,"Notes:"]
[null,null,null,"Technical checklist questions",null,null,null,null,null,null,null,null,null,null,null,null,null,"Y","N","NA","NI"]
["C","11.1.",null,"For sites that have a mortality box:  The mortality box is scavenger proof. "]
["C","11.2.",null,"For sites that render mortalities:  All mortalities are picked up within 72 hrs."]
["C","11.3.",null,"For sites that are composting mortalities:  Mortalities are completely covered by compost material (no exposed mortalities allowed)"]
["C","11.4.",null,"For sites that bury animal mortalities:  \n- Mortalities are buried at least 5’ above the seasonal high water table.\n- Soil type restrictions for burial are met (no coarse-textured soils)."]
["C","11.5.",null,"For sites that incinerate animal mortalities: There is an afterburner on the stack of the primary incineration unit?"]
[null,"If the answer to any of questions 11.1 through 11.5 was “No”, Refer to Board of Animal Health "]
[null,null,null,"Discharge checklist questions",null,null,null,null,null,null,null,null,null,null,null,null,null,"C","NC","NA","NI"]
["C","11.6.",null,"There is evidence (e.g., inadequate buffer, steep slopes, channels, matted or dead vegetation, clean water run-on, stormwater flow) that process wastewater from the mortality management area reached surface waters of the state or tile intakes, sinkholes, fractured bedrock, well, mine or quarry. "]
[null,null,null,"(7020.2003, subp. 1 & 3, 7050.0210, subp. 2 & 13, 7060.0600, subp. 2, CAFO/1000 AU specific - 7020.2003, subp. 2., NPDES/SDS Part 10.2.)"]
["C","11.7.",null,"There is evidence (e.g., ponding, coarse-textured soils, depth to water table) that process wastewater from the animal mortality managment area could impact ground water. "]
[null,null,null,"(7020.2003, subp. 1 & 3, 7050.0210, subp. 2 & 13, 7060.0600, subp. 2, CAFO/1000 AU specific - 7020.2003, subp. 2., NPDES/SDS Part 10.2.)"]
[11.2,null,null,"Discharge inspection requirement",null,null,null,null,null,null,null,null,null,null,null,null,null,"C","NC","NA","NI"]
["I","11.8.",null,"Mortality management area discharge requirements are met.   "]
[null,null,null,"(7020.2003, subp. 1 & 3, 7050.0210, subp. 2 & 13, 7060.0600, subp. 2, CAFO/1000 AU specific - 7020.2003, subp. 2., NPDES/SDS Part 10.2.)"]
[12,"12._",null,"Nitrogen - manure testing requirements\n(Include as part of all compliance inspections for sites with 100 AU or more)",null,null,null,null,null,null,null,null,null,null,null,null,null,null,null,null,null,"Notes:"]
[null,null,null,"Checklist questions",null,null,null,null,null,null,null,null,null,null,null,null,null,"C","NC","NA","NI"]
["C","12.1.",null,"Manure analyses within the last 4 years\n(Not required if 100 AU or less contribute to manure storage) "]
[null,null,null,"(7020.2225 Subp. 5. B. (3), 7020.2225 Subp. 2. C.)"]
["N","12.2.",null,"NPDES/SDS - Manure analyses within the last year "]
[null,null,null,"(NPDES/SDS Part 4.1.1.)"]
["C","12.3.",null,"Total production of manure is reasonable for facility size "]
[null,null,null,"(7020.2225 Subp. 4. C. & D., 7020.2225 Subp. 5. B. (7), NPDES/SDS Part 2.3.1. a), )"]
[12.2,null,null,"Inspection requirement",null,null,null,null,null,null,null,null,null,null,null,null,null,"C","NC","NA","NI"]
["I","12.4.",null,"Manure testing requirements are met.   "]
[null,null,null,"(7020.2225 Subp. 5. B. (3), 7020.2225 Subp. 2., NPDES/SDS Part 4.1.)"]
[13,"13._",null,"Nitrogen - transferred manure ownership land application requirements\n(Include for sites with 300 AU or more when some manure ownership is transferred)",null,null,null,null,null,null,null,null,null,null,null,null,null,null,null,null,null,"Notes:"]
[null,null,null,"Checklist questions",null,null,null,null,null,null,null,null,null,null,null,null,null,"C","NC","NA","NI"]
["C","13.1.",null,"Field ID (minimum: County, Township, Section) "]
[null,null,null,"(7020.2225 Subp. 5. D. (1) (d), NPDES/SDS Part 4.4.)"]
["C","13.2.",null,"Dates of application, application rate, and total volume  transferred "]
[null,null,null,"(7020.2225 Subp. 5. D. (1) (a) & (b) & (c), NPDES/SDS Part 4.4.)"]
["C","13.3.",null,"Names of recipients "]
[null,null,null,"(7020.2225 Subp. 5. D. (1) (c), NPDES/SDS Part 4.4.)"]
[13.2,null,null,"Inspection requirement",null,null,null,null,null,null,null,null,null,null,null,null,null,"C","NC","NA","NI"]
["I","13.4.",null,"Adequate transferred manure land application records are being kept. "]
[null,null,null,"(7020.2225 Subp. 5. D., 7020.2225 Subp. 5. A., 7020.2225 Subp. 5. C., NPDES/SDS Part 4.4.)"]
[14,"14._",null,"Nitrogen - non-transferred manure ownership land application requirements\n(Include for sites with 100 AU or more when some manure ownership is retained)",null,null,null,null,null,null,null,null,null,null,null,null,null,null,null,null,null,"Notes:"]
[null,null,null,"Checklist questions",null,null,null,null,null,null,null,null,null,null,null,null,null,"C","NC","NA","NI"]
["C","14.1.",null,"Field IDs, Acres for each field and Crop history "]
[null,null,null,"(7020.2225 Subp. 5. B. (1), NPDES/SDS Part 4.5.)"]
["C","14.2.",null,"Application method and rate applied per acre "]
[null,null,null,"(7020.2225 Subp. 5. B. (2), NPDES/SDS Part 4.5.)"]
["C","14.3.",null,"Date(s) of manure application "]
[null,null,null,"(7020.2225 Subp. 5. B. (4), NPDES/SDS Part 4.5.)"]
["C","14.4.",null,"Plant-available N per acre from commercial fertilizer and manure (including carry-over) "]
[null,null,null,"(7020.2225 Subp. 5. B. (6), NPDES/SDS Part 4.5.)"]
[14.2,null,null,"Inspection requirement",null,null,null,null,null,null,null,null,null,null,null,null,null,"C","NC","NA","NI"]
["I","14.5.",null,"Adequate retained manure land application records are being kept. "]
[null,null,null,"(7020.2225 Subp. 5., NPDES/SDS Parts 4.5. & 9.1.6.2.)  "]
[null,"14.6.",null,"Nitrogen applied at agronomic rates (total available N is not more than recommended for crop grown - evaluated with worksheet to verify). "]
[null,null,null,"(7020.2225 Subp. 3. A., NPDES/SDS Parts 4.5. & 4.5.6.)"]
[null,"14.7.",null,"If winter application or broadcast with incorporation after 24 hrs, 300 ft setback observed for sensitive features and tile intakes (ask producer). "]
[null,null,null,"(7020.2225 Subp. 3. B., 7020.2225 Subp. 6., 7020.2225 Subp. 7., 7020.2225 Subp. 8., NPDES/SDS Parts 4.5. & 4.5.11 & 4.5.12.)"]
[15,"15._",null,"Phosphorus - land application requirements\n(Optional - sites with 300 AU or more when some manure ownership is retained)",null,null,null,null,null,null,null,null,null,null,null,null,null,null,null,null,null,"Notes:"]
[null,null,null,"Checklist questions",null,null,null,null,null,null,null,null,null,null,null,null,null,"C","NC","NA","NI"]
["C","15.1.",null,"Soil phosphorus test results are less than four years old "]
[null,null,null,"(7020.2225 Subp. 5. B. (8), 7020.2225 Subp. 3. C., NPDES/SDS Part 4.5.5,)"]
["C","15.2.",null,"Plant-available P per acre from commercial fertilizers and manure is provided "]
[null,null,null,"(7020.2225 Subp. 5. B. (6), NPDES/SDS Part 4.5.)"]
[15.2,null,null,"Inspection requirement",null,null,null,null,null,null,null,null,null,null,null,null,null,"C","NC","NA","NI"]
["I","15.3.",null,"Phosphorus contributions listed and testing requirements are met."]
[null,null,null,"(7020.2225 Subp. 5., NPDES/SDS Parts 4.5. & 9.1.6.2.)"]
[null,null,null,"Checklist questions",null,null,null,null,null,null,null,null,null,null,null,null,null,"C","NC","NA","NI"]
["C","15.4.",null,"For any field over 150 ppm Bray or 120 Olsen, a permit approved P strategy is followed "]
[null,null,null,"(7020.2225 Subp. 3.C., NPDES Part 4.5.7.2.)"]
["C","15.5.",null,"For manure applied in special protection areas or within 300 feet of open tile intakes where soil test P is over 75 ppm Bray or 60 Olsen, a permit approved P strategy is followed "]
[null,null,null,"(7020.2225 Subp. 3.C., NPDES/SDS Part 4.5.7.2.)"]
["C","15.6.",null,"For manure applied in special protection areas or within 300 feet of open tile intakes where soil test P is over 21 ppm Bray or 16 Olsen, P applied during the rotation (6 years) is less than P removed"]
[null,null,null,"(7020.2225 Subp. 6., NPDES/SDS Parts 4.5. & 4.5.12.3. & 4.5.12.4.)"]
[15.4,null,null,"Inspection requirement",null,null,null,null,null,null,null,null,null,null,null,null,null,"C","NC","NA","NI"]
["I","15.7.",null,"Phosphorus management is adequate \n(i.e. not building P over 6 yrs - use worksheet to verify)."]
[null,null,null,"(7020.2225 Subp. 3.C., 7020.2225 Subp. 6. NPDES/SDS Parts 4.5. & 4.5.7.2. & 4.5.12.3. & 4.5.12.4.)"]
[16,"16.",null,"In-field land application inspection",null,null,null,null,null,null,null,null,null,null,null,null,null,null,null,null,null,"Notes:"]
[null,null,null,"Checklist questions",null,null,null,null,null,null,null,null,null,null,null,null,null,"C","NC","NA","NI"]
["C","16.1.",null,"Method of application is consistent with the approved MMP\n(if MMP is required)."]
[null,null,null,"Note: For sites that are NOT operating under a NPDES or SDS permit: if the “Method of application” is deviating from the MMP and still compliant, this question should not be marked non-compliant.\n"]
[null,null,null,"(7020.2225 Subp. 4.D. (5), NPDES/SDS Parts 4. & 11.)\n"]
["C","16.2.",null,"Cover crop on fields with manure application during June, July, August\n(if MMP is required)"]
[null,null,null,"(7020.2225 Subp. 4. D. (13), NPDES/SDS Parts 4.5. & 4.5.10.)"]
["C","16.3.",null,"Winter application to fields identified in the owner’s MMP\n(if MMP is required) "]
[null,null,null,"(7020.2225 Subp. 4. D. (10), NPDES/SDS Parts 4.5. & 4.5.11.1.a), )"]
["C","16.4.",null,"No evidence of discharge to waters, tile intakes, or sinkholes during the application process "]
[null,null,null,"(7020.2225 Subp. 1. A., 7050.0210, subp. 2 & 13, 7060.0600, subp. 2, NPDES/SDS Parts 4.5. & 4.5.1. & 10.3. & 10.4.)"]
["C","16.5.",null,"No evidence of manure applied into the road right-of-way "]
[null,null,null,"(7020.2225 Subp. 1. B., NPDES/SDS Part 4.5.12.7.)"]
["C","16.6.",null,"25 foot setback from sensitive features when manure is injected or incorporated within 24 hrs and prior to rainfall. (lakes, rivers, streams, intermittent streams, un-bermed ditches, etc.) "]
[null,null,null,"(7020.2225 Subp. 3. B., 7020.2225 Subp. 6., NPDES/SDS Parts 4.5. & 4.5.11, & 4.5.12.)"]
["C","16.7.",null,"50 foot setback from sinkholes and wells "]
[null,null,null,"(7020.2225 Subp. 3. B., 7020.2225 Subp. 8., NPDES/SDS Parts 4.5. & 4.5.11, & 4.5.12.)"]
["C","16.8.",null,"300 foot setback to sensitive features when manure is not injected or incorporated within 24 hrs and prior to rainfall. "]
[null,null,null,"(7020.2225 Subp. 3. B., 7020.2225 Subp. 6., NPDES/SDS Parts 4.5. & 4.5.11, & 4.5.12.)"]
["N","16.9.",null,"NPDES/SDS - Manure incorporated when 50% chance of 1/2\" of rain predicted 24 hours after application "]
[null,null,null,"(NPDES/SDS Part 4.5.8.)"]
["N","16.10.",null,"NPDES/SDS - Coarse textured soil temps 50o or less "]
[null,null,null,"(NPDES/SDS Part 4.5.9.)"]
["N","16.11.",null,"NPDES/SDS - No application of liquid manure after Nov 30 to frozen/snow covered soil "]
[null,null,null,"(NPDES/SDS Part 4.5.11.2.)"]
["N","16.12.",null,"NPDES/SDS - Application of solid manure after Nov 30 to frozen/snow covered soil on fields with slope of 6% or less and no active snowmelt "]
[null,null,null,"(NPDES/SDS Part 4.5.11.1.)"]
[16.2,null,null,"Inspection requirement",null,null,null,null,null,null,null,null,null,null,null,null,null,"C","NC","NA","NI"]
["I","16.13.",null,"In-field land application requirements are met.   "]
[null,null,null,"(7020.2225, 7050.0210, subp. 2 & 13, 7060.0600, subp. 2 NPDES/SDS Parts 4.5.8 & 4.5.9. & 4.5.11.1.)"]
[null,null,null,"Additional considerations:"]
[null,null,null,"Inspector may want to consider conducting a Nitrogen and Phosphorus review of the application area if the inspection identifies concerns regarding:"]
[null,null,null,"·","Manure application is not spread in a uniform pattern (potential over application)."]
[null,null,null,"·","Manure application rates appears to be an excessive (not an agronomic rate)."]
[17,"17.",null,"Animal feedlot and manure storage area closure",null,null,null,null,null,null,null,null,null,null,null,null,null,null,null,null,null,"Notes:"]
[null,null,null,"Checklist questions",null,null,null,null,null,null,null,null,null,null,null,null,null,"C","NC","NA","NI"]
["C","17.1.",null,"For feedlots that have permanently ceased operation of the animal feedlot or a manure storage area for more than one year: Manure and manure-contaminated soils have been removed and land applied. "]
[null,null,null,"(7020.2025 A., NPDES/SDS Part 7.1.2.)"]
["C","17.2.",null,"For open lot areas and stockpile sites with earthen floors/pads that are closed: Forage is growing that will reduce nitrogen in the soil. "]
[null,null,null,"(7020.2025 B., NPDES/SDS Part 7.2.2.2.)"]
["C","17.3.",null,"A certified letter was sent to the county or MPCA within 60-days of closure. "]
[null,null,null,"(7020.2025 C., NPDES/SDS Part 7.2.6.)"]
[17.2,null,null,"Inspection requirement",null,null,null,null,null,null,null,null,null,null,null,null,null,"C","NC","NA","NI"]
["I","17.4.",null,"Animal feedlot or manure storage area closure requirements are met."]
[null,null,null,"(7020.2025, NPDES/SDS Part 7)"]
[null,null,null,"Additional considerations:"]
[null,null,null,"For sites planning demolition as part of the closure process, refer owner to solid waste staff at MPCA or County."]
[18,"18.",null,"Permit requirements",null,null,null,null,null,null,null,null,null,null,null,null,null,null,null,null,null,"Notes:"]
[null,null,null,"Inspection requirement",null,null,null,null,null,null,null,null,null,null,null,null,null,"C","NC","NA","NI"]
[null,"18.1.",null,"Interim or Individual permit requirements are met. "]
[null,null,null,"(7001.0150 Subp. 3. E. & F., 7020.0535 subp. 8, and/or citation of specific requirements that are in Interim or Individual permit) "]
["N","18.2.",null,"NPDES/SDS - The Permittee has retained all records required by the conditions of the Permit for a minimum of six years. "]
[null,null,null,"(NPDES/SDS Part 9.1.1)"]
["N","18.3.",null,"NPDES/SDS - The Permittee has maintained the records of the results of the inspections required by the Permit. "]
[null,null,null,"(NPDES/SDS Part 9.1.4)"]
[19,"19.",null,"Summary of environmental upgrades",null,null,null,null,null,null,null,null,null,null,null,null,null,null,null,null,null,"Notes:"]
[null,null,null,"Inspectors – If environmental upgrades have been implemented since the last inspection, they should be recorded in the “Audit Data” screen in Tempo.\nCheck yes to all that have been completed since the last inspection."]
[null,null,null,"Environmental upgrades",null,null,null,null,null,null,null,null,null,null,null,null,null,"Y","N","NA","NI"]
[null,"19.1.",null,"Animal access to public waters was eliminated."]
[null,"19.2.",null,"Buffers were installed."]
[null,"19.3.",null,"Clean water diversions were installed."]
[null,"19.4.",null,"Filter strips were installed."]
[null,"19.5.",null,"Gutters were installed."]
[null,"19.6.",null,"Herd size was reduced."]
[null,"19.7.",null,"An infiltration area was installed"]
[null,"19.8.",null,"Milk house waste discharge was eliminated."]
[null,"19.9.",null,"Open lots were closed."]
[null,"19.10.",null,"Open lots were reduced in size."]
[null,"19.11.",null,"Open lots were relocated."]
[null,"19.12.",null,"A permanent liquid manure storage area was constructed."]
[null,"19.13.",null,"A permanent solid manure storage area was constructed."]
[null,"19.14.",null,"The owner permanently ceased operation of the feedlot."]
[null,"19.15.",null,"An unpermitted LMSA was closed."]
[null,"19.16.",null,"An unpermitted LMSA was upgraded."]
[null,"19.17.",null,"Other environmental upgrades and or measures were implemented."]
[null,"19.18.",null,"A partial (i.e., anything less than complete) environmental upgrade was completed since the last inspection. "]
[null,null,null,"*Inspectors - Report this only once upon initial verification."]
[null,"19.9.",null,"A complete (i.e., all pollution hazards have been eliminated) environmental upgrade was completed since the last inspection. "]
[null,null,null,"*Inspectors - Report this only once upon initial verification."]
[20,"20.",null,"Key"]
[null,"C",null,"Compliance – At the time of the inspection, the feedlot and/or owner meet the requirements of applicable state rules and statutes or permit conditions. "]
[null,"NC",null,"Non-Compliance – At the time of the inspection, the feedlot and/or owner do not meet the requirements of applicable state rules and statutes or permit conditions."]
[null,"NA",null,"Not Applicable – The condition is not present at this feedlot."]
[null,"NI",null,"Not Inspected – The condition was not inspected."]
[null,"Y",null,"Yes – Does not indicate compliance or non-compliance."]
[null,"N",null,"No – Does not indicate compliance or non-compliance."]
[null,"Checklist question",null,null,null,null,null,"Checklist questions are used by the inspector to evaluate feedlot conditions."]
[null,"Inspection requirement",null,null,null,null,null,"Inspection requirements are statements that summarize the regulatory requirements of applicable state rules and statutes or permit conditions"]
[null,"Acronyms (used throughout the checklist)"]
[null,"AO",null,"Administrative Order",null,null,null,null,null,null,null,null,"MPCA",null,"Minnesota Pollution Control Agency"]
[null,"APO",null,"Administrative Penalty Order",null,null,null,null,null,null,null,null,"N",null,"Nitrogen"]
[null,"AU",null,"Animal Unit",null,null,null,null,null,null,null,null,"NPDES",null,"National Pollutant Discharge Elimination System"]
[null,"CAFO",null,"Concentrated Animal Feeding Operation",null,null,null,null,null,null,null,null,"NOV",null,"Notice of Violation"]
[null,"CSF",null,"Construction Short Form",null,null,null,null,null,null,null,null,"P",null,"Phosphorus"]
[null,"LOW",null,"Letter of Warning",null,null,null,null,null,null,null,null,"SDS",null,"State Disposal System"]
[null,"OLA",null,"Open Lot Agreement",null,null,null,null,null,null,null,null,"STIP",null,"Stipulation agreement"]
[21]

{"sheet":"Nitrogen Worksheet","index":5,"n_rows":78,"n_cols":17,"rows_kept":78,"cut":false,"hidden":true,"merged":[[2,0,2,13],[76,9,76,10],[77,1,77,3],[77,5,77,7],[77,9,77,11],[74,1,74,3],[74,5,74,7],[74,9,74,12],[74,14,74,16],[75,1,75,3],[75,5,75,7],[75,9,75,12],[75,13,76,16],[76,1,76,2],[76,5,76,6],[73,1,73,2],[73,5,73,6],[73,9,73,11],[73,14,73,15],[65,12,65,16],[68,1,68,2],[68,3,68,4],[68,7,68,9],[68,10,68,11],[69,1,69,4],[69,7,69,11],[69,14,69,16],[61,1,61,2],[61,3,61,4],[61,5,62,5],[61,6,61,8],[61,10,62,11],[61,12,61,15],[62,1,62,2],[62,3,62,4],[62,6,62,9],[62,12,62,16],[68,14,68,15],[64,1,64,2],[64,3,64,4],[64,5,65,5],[64,6,64,9],[64,10,65,11],[64,12,64,15],[65,1,65,4],[65,6,65,9],[56,1,56,2],[56,3,56,4],[56,5,57,5],[56,6,56,9],[56,10,57,11],[56,12,56,15],[57,1,57,4],[57,6,57,9],[57,12,57,16],[52,0,52,16],[53,1,53,2],[53,3,53,4],[53,5,54,5],[53,6,53,8],[53,10,54,11],[53,12,53,15],[54,1,54,4],[54,6,54,9],[54,12,54,16],[49,1,49,2],[49,3,49,4],[49,5,50,5],[49,6,49,9],[49,10,50,11],[49,12,49,15],[50,1,50,4],[50,6,50,9],[50,12,50,16],[43,3,43,4],[43,5,43,6],[43,7,43,8],[43,10,43,11],[45,0,45,16],[46,1,46,2],[46,3,46,4],[46,5,47,5],[46,6,46,8],[46,10,47,11],[46,12,46,15],[47,1,47,4],[47,6,47,9],[47,12,47,16],[41,3,41,4],[41,5,41,6],[41,7,41,8],[41,10,41,11],[42,3,42,4],[42,5,42,6],[42,7,42,8],[42,10,42,11],[39,3,39,4],[39,5,39,6],[39,7,39,8],[39,10,39,11],[40,3,40,4],[40,5,40,6],[40,7,40,8],[40,10,40,11],[29,2,29,16],[31,0,31,4],[31,5,31,16],[32,3,32,4],[34,7,34,10],[38,3,38,8],[38,9,38,11],[27,2,27,3],[27,4,27,5],[27,6,27,8],[27,9,27,12],[27,13,27,14],[27,15,27,16],[26,2,26,3],[26,4,26,5],[26,6,26,8],[26,9,26,12],[26,13,26,14],[26,15,26,16],[25,2,25,3],[25,4,25,5],[25,6,25,8],[25,9,25,12],[25,13,25,14],[25,15,25,16],[24,2,24,3],[24,4,24,5],[24,6,24,8],[24,9,24,12],[24,13,24,14],[24,15,24,16],[23,2,23,3],[23,4,23,5],[23,6,23,8],[23,9,23,12],[23,13,23,14],[23,15,23,16],[22,2,22,3],[22,4,22,5],[22,6,22,8],[22,9,22,12],[22,13,22,14],[22,15,22,16],[21,2,21,3],[21,4,21,5],[21,6,21,8],[21,9,21,12],[21,13,21,14],[21,15,21,16],[20,2,20,3],[20,4,20,5],[20,6,20,8],[20,9,20,12],[20,13,20,14],[20,15,20,16],[19,2,19,3],[19,4,19,5],[19,6,19,8],[19,9,19,12],[19,13,19,14],[19,15,19,16],[16,2,16,3],[16,4,16,5],[16,6,16,8],[16,9,16,12],[16,13,16,14],[16,15,16,16],[18,2,18,3],[18,4,18,5],[18,6,18,8],[18,9,18,12],[18,13,18,14],[18,15,18,16],[17,2,17,3],[17,4,17,5],[17,6,17,8],[17,9,17,12],[17,13,17,14],[17,15,17,16],[12,13,12,14],[14,2,14,3],[14,4,15,5],[14,6,14,8],[14,9,14,12],[14,13,15,14],[14,15,15,16],[15,2,15,3],[15,6,15,8],[15,9,15,12],[5,2,5,7],[5,10,5,13],[8,1,8,3],[8,4,8,5],[8,6,8,9],[8,10,8,14],[9,1,9,3],[9,4,9,5],[9,6,9,9],[9,10,9,14]]}
["Nitrogen record review worksheet"]
["This worksheet should be completed to verify compliance with Nitrogen application rate restrictions."]
["Complete one worksheet for each crop rotation and manure application combination.  \nFor multiple combinations, choose the three that receive the most manure or are most common."]
[null,null,"= Where to enter information",null,null,null,null,"= Automatic calculations"]
[]
["Producer:",null,null,null,null,null,null,null,null,"Registration #:",null,null,null,null,null,"Crop Year:"]
[]
["Step 1 - List the crop rotation"]
[null,{"$f":"IF(ISBLANK(Q6),\"Crop Grown\",\"Crop Grown (\"&Q6&\")\")","v":"Crop Grown"},null,null,"Yield",null,{"$f":"IF(ISBLANK(Q6),\"Crop Last Year\",Q6-1 &\" Crop\")","v":"Crop Last Year"},null,null,null,{"$f":"IF(ISBLANK(Q6),\"Crop 2 Years Ago\",Q6-2 &\" Crop\")","v":"Crop 2 Years Ago"}]
[]
[null,false]
[]
["Step 2 - List the nitrogen recommendation for the crop grown based on Table 1:",null,null,null,null,null,null,null,null,null,null,null,null,{"$f":"IF(OR(ISBLANK(B10),ISBLANK(E10),ISBLANK(G10),ISBLANK(K10)),\"\",IFERROR(NNeeds(B10,G10,K10,E10,B11)-second_Year_N(B10,G10,K10,B11),\"error\"))","v":""},null,"(N removal value)"]
[null,null,"Table 1"]
[null,null,"Crop to Be Grown",null,"Yield",null,"Crop Last Year",null,null,"Crop 2 Years Ago",null,null,null,"Max\nN Needs",null,"Max N Needs *\n(irrigated sands)"]
[null,null,{"$f":"IF(ISBLANK(Q6),\"\",\"(\"&Q6&\")\")","v":""},null,null,null,{"$f":"IF(ISBLANK(Q6),\"\",\"(\"&Q6-1&\")\")","v":""},null,null,{"$f":"IF(ISBLANK(Q6),\"\",\"(\"&Q6-2&\")\")","v":""}]
[null,null,"Corn",null,"Any",null,"Soybeans",null,null,"No Alfalfa",null,null,null,{"$f":" Database!$H$13","v":150},null,{"$f":"Database!$X$123","v":205}]
[null,null,"Corn",null,"Any",null,"Corn",null,null,"No Alfalfa",null,null,null,{"$f":"Database!$P$13","v":195},null,{"$f":"Database!$AF$123","v":235}]
[null,null,"Corn",null,"Any",null,"Corn",null,null,"Alfalfa (2+ yr old stand)",null,null,null,{"$f":"Database!$P$13-Database!$C$111","v":80},null,{"$f":"Database!$AF$123-Database!$S$127","v":150}]
[null,null,"Corn",null,"Any",null,"Corn",null,null,"Alfalfa (1 yr old stand)",null,null,null,{"$f":"Database!$P$13-Database!$D$111","v":120},null,{"$f":"Database!$AF$123-Database!$T$127","v":170}]
[null,null,"Corn",null,"Any",null,"Alfalfa",null,null,"Alfalfa",null,null,null,{"$f":"Database!$E$13","v":40},null,{"$f":"Database!$U$123","v":150}]
[null,null,"Corn",null,"Any",null,"Alfalfa",null,null,"No Alfalfa",null,null,null,{"$f":"Database!$F$13","v":80},null,{"$f":"Database!$V$123","v":170}]
[null,null,"Wheat",null,"60 – 80 bu",null,"Corn",null,null,"No Alfalfa",null,null,null,{"$f":"Database!$AR$17 & \" - \" & Database!$AR$19","v":"110 - 150"},null,"not applicable"]
[null,null,"Wheat",null,"60 – 80 bu",null,"Soybeans",null,null,"No Alfalfa",null,null,null,{"$f":"Database!$AJ$17 & \" - \" & Database!$AJ$19","v":"90 - 130"},null,"not applicable"]
[null,null,"Oats",null,"81 – 100 bu",null,"Corn",null,null,"No Alfalfa",null,null,null,{"$f":"Database!$AR$31","v":70},null,"not applicable"]
[null,null,"Oats",null,"81 – 100 bu",null,"Soybeans",null,null,"No Alfalfa",null,null,null,{"$f":"Database!$AJ$31","v":30},null,"not applicable"]
[null,null,"Sweet Corn",null,"8 - 9 tons",null,"Corn",null,null,"Any",null,null,null,{"$f":"Database!$AR$86","v":120},null,"not applicable"]
[null,null,"Sweet Corn",null,"8 - 9 tons",null,"Soybeans",null,null,"Any",null,null,null,{"$f":"Database!$AJ$86","v":90},null,"not applicable"]
[null,null,"NOTE: \"corn\" includes corn silage crops"]
[null,null,"* Only for corn grown on irrigated sands - Soil type of the field must end with \"sand\" and the field must be irrigated. \n   Max available N from manure limited to 180 lbs.  Commercial fertilizer only applied at planting or to growing crops."]
["Step 3 - List the manure source and nutrient analysis"]
["Manure Source (description):"]
[null,null,"Animal Type:",null,null,null,"Analysis:","N:",null,"P:",null,null,"K:",null,null,"units:"]
[]
["Step 4 - List the method of manure application:"]
[]
["Step 5 - List the first year nitrogen availability from Table 2:",null,null,null,null,null,null,null,null,{"$f":"IF(OR(ISBLANK(D33),ISBLANK(H35)),\"\",IFERROR(Manure_avail(D33,H35)/100,\"error\"))","v":""}]
[null,null,"Table 2"]
[null,null,null,"Broadcast Incorporation Timing",null,null,null,null,null,"Injection"]
[null,null,null,"> 96 hours",null,"12 - 96 hours",null,"< 12 hours",null,"Sweep","Knife"]
[null,null,"Beef",{"$f":"'Data Update Form'!$B$296 & \"%\"","v":"25%"},null,{"$f":"'Data Update Form'!$C$296& \"%\"","v":"45%"},null,{"$f":"'Data Update Form'!$D$296& \"%\"","v":"60%"},null,{"$f":"'Data Update Form'!$E$296& \"%\"","v":"60%"},{"$f":"'Data Update Form'!$F$296& \"%\"","v":"50%"}]
[null,null,"Dairy",{"$f":"'Data Update Form'!$B$300 & \"%\"","v":"20%"},null,{"$f":"'Data Update Form'!$C$300& \"%\"","v":"40%"},null,{"$f":"'Data Update Form'!$D$300& \"%\"","v":"55%"},null,{"$f":"'Data Update Form'!$E$300& \"%\"","v":"55%"},{"$f":"'Data Update Form'!$F$300& \"%\"","v":"50%"}]
[null,null,"Swine",{"$f":"'Data Update Form'!$B$304 & \"%\"","v":"35%"},null,{"$f":"'Data Update Form'!$C$304& \"%\"","v":"55%"},null,{"$f":"'Data Update Form'!$D$304& \"%\"","v":"75%"},null,{"$f":"'Data Update Form'!$E$304& \"%\"","v":"80%"},{"$f":"'Data Update Form'!$F$304& \"%\"","v":"70%"}]
[null,null,"Poultry",{"$f":"'Data Update Form'!$B$308 & \"%\"","v":"45%"},null,{"$f":"'Data Update Form'!$C$308& \"%\"","v":"55%"},null,{"$f":"'Data Update Form'!$D$308& \"%\"","v":"70%"},null,{"$f":"'Data Update Form'!$E$308& \"%\"","v":"70%"},{"$f":"'Data Update Form'!$F$308& \"%\"","v":"70%"}]
[]
[{"$f":"IF(ISBLANK(Q6),\"Step 6 - Determine how many pounds of nitrogen were available the first year for every 1,000 gallons or tons of manure applied per acre.\",\"Step 6 - Determine how many pounds of nitrogen were available the first year (\"&Q6&\") for every 1,000 gallons or tons of manure applied per acre.\")","v":"Step 6 - Determine how many pounds of nitrogen were available the first year for every 1,000 gallons or tons of manure applied per acre."}]
["A)",{"$f":"IF(I33=\"\",\"\",I33)","v":""},null,{"$f":"IF(Q33=\"\",\"\",Q33)","v":""},null,"X",null,null,null,{"$f":"IF(Q33=\"\",\"\",IF(Q33=\"lbs/ton\",\"tons/acre\",\"gal/acre\"))","v":""},"=",null,{"$f":"IF(OR(B47=\"\",ISBLANK(G47),ISBLANK($Q$33)),\"\",IFERROR(IF($Q$33=\"lbs/1000 gal\",B47*G47/1000,B47*G47),\"error\"))","v":""},null,null,null,"lbs"]
[null,"Manure N Test Result\nfrom Step 3",null,null,null,null,"Application Rate*",null,null,null,null,null,"Total Manure N Applied/Acre"]
[null,"*When done long-hand, don't forget to also divide result by 1,000 for liquid manure test results reported in lbs/1,000 gal"]
["B)",{"$f":"IF(M47=\"\",\"\",M47)","v":""},null,{"$f":"Q47","v":"lbs"},null,"X",{"$f":"IF(J37=\"\",\"\",J37)","v":""},null,null,null,"=",null,{"$f":"IF(OR(B50=\"\",G50=\"\"),\"\",IFERROR(B50*G50,\"error\"))","v":""},null,null,null,"lbs"]
[null,"Total Manure N Applied/Acre",null,null,null,null,"Availability Factor\nfrom Step 5",null,null,null,null,null,"Total Manure N Available/Acre"]
[]
[{"$f":"IF(ISBLANK(Q6),\"Step 7 - Determine how many pounds of phosphorus were available the first year for every 1,000 gallons or tons of manure applied per acre.\",\"Step 7 - Determine how many pounds of phosphorus were available the first year (\"&Q6&\") for every 1,000 gallons or tons of manure applied per acre.\")","v":"Step 7 - Determine how many pounds of phosphorus were available the first year for every 1,000 gallons or tons of manure applied per acre."}]
["A)",{"$f":"IF(K33=\"\",\"\",K33)","v":""},null,{"$f":"IF(Q33=\"\",\"\",Q33)","v":""},null,"X",{"$f":"IF(G47=\"\",\"\",G47)","v":""},null,null,{"$f":"IF(Q33=\"\",\"\",IF(Q33=\"lbs/ton\",\"tons/acre\",\"gal/acre\"))","v":""},"=",null,{"$f":"IF(OR(B54=\"\",G54=\"\",ISBLANK($Q$33)),\"\",IFERROR(IF($Q$33=\"lbs/1000 gal\",B54*G54/1000,B54*G54),\"error\"))","v":""},null,null,null,"lbs"]
[null,"Manure P Test Result\nfrom Step 3",null,null,null,null,"Application Rate*",null,null,null,null,null,"Total Manure P Applied/Acre"]
[null,"*When done long-hand, don't forget to also divide result by 1,000 for liquid manure test results reported in lbs/1,000 gal"]
["B)",{"$f":"IF(M54=\"\",\"\",M54)","v":""},null,{"$f":"Q54","v":"lbs"},null,"X",0.8,null,null,null,"=",null,{"$f":"IF(OR(B57=\"\",G57=\"\"),\"\",IFERROR(B57*G57,\"error\"))","v":""},null,null,null,"lbs"]
[null,"Total Manure P Applied/Acre",null,null,null,null,"Availability Factor\n(always 80% for P)",null,null,null,null,null,"P2O5 Available/Acre"]
[]
["Step 8 - Determine the second year nitrogen credit (if none leave blank)",null,null,null,null,null,null,null,null,null,null,null,null,null,null,"Animal Type of Manure Last Year:"]
[null,{"$f":"IF(ISBLANK(Q6),\"(Residual N from manure applications for the previous years crop)\",\"(Residual N from manure applications for the \"&Q6-1&\" crop)\")","v":"(Residual N from manure applications for the previous years crop)"}]
["A)",null,null,null,null,"X",null,null,null,{"$f":"IF(D62=\"\",\"\",IF(D62=\"lbs/ton\",\"tons/acre\",\"gal/acre\"))","v":""},"=",null,{"$f":"IF(OR(ISBLANK(B62),ISBLANK(G62),ISBLANK(D62)),\"\",IFERROR(IF(D62=\"lbs/1000 gal\",B62*G62/1000,B62*G62),\"error\"))","v":""},null,null,null,"lbs"]
[null,"Last Years Manure N Test",null,"units",null,null,"Application Rate*",null,null,null,null,null,"Total Manure N\nApplied/Acre Last Year"]
[null,"*When done long-hand, don't forget to also divide result by 1,000 for liquid manure test results reported in lbs/1,000 gal"]
["B)",{"$f":"IF(M62=\"\",\"\",M62)","v":""},null,"lbs",null,"X",{"$f":"IF(ISBLANK(Q60),\"\",IF(Q60=\"Swine\", 0.15, 0.25))","v":""},null,null,null,"=",null,{"$f":"IF(OR(ISBLANK(B62),ISBLANK(G62),ISBLANK(D62)),\"\",IFERROR(B65*G65,\"error\"))","v":""},null,null,null,"lbs"]
[null,"Total Manure N \nApplied/Acre Last Year",null,null,null,null,"Availability Factor\nSwine = 15%\nAll others = 25%",null,null,null,null,null,"2nd Year N Credit"]
[]
["Step 9 - List additional nutrient contributions from commercial fertilizers and irrigation water"]
["A)",null,null,"lbs/acre",null,null,"B)",null,null,null,"lbs/acre",null,null,"C)",null,null,"lbs/acre"]
[null,"N from Fertilizer (all types)*",null,null,null,null,null,"P2O5 from Fertilizer (all types)*",null,null,null,null,null,null,"N from Irrigation Water"]
[null,"*List available N & P2O5, not the amont of fertilzer product applied.  Include starter, herbicide carrier, supplemental, etc.  "]
[]
["Step 10 - Determine the total nutrient budget"]
["A)",{"$f":"IF(M50=\"\",\"\",M50)","v":""},null,"lbs","+",{"$f":"IF(B74=\"\",\"\",IF(M65=\"\",0,M65))","v":""},null,"lbs","+",{"$f":"IF(B74=\"\",\"\",IF(AND(B69=\"\",O69=\"\"),0,B69+O69))","v":""},null,null,"lbs","=",{"$f":"IF(OR(B74=\"\"),\"\",IFERROR(B74+F74+J74,\"error\"))","v":""},null,"lbs"]
[null,"Total Manure N Available",null,null,null,"2nd Year N Credit",null,null,null,"N from Other Sources",null,null,null,null,"Total N Applied per acre"]
[null,"(Step 6B)",null,null,null,"(Step 8B)",null,null,null,"(Step 9A + Step 9C)",null,null,null,{"$f":"IFERROR(IF(O74=\"\",\"\",IF(O74>(N13*1.2),\"Significantly More Nitrogen than Recommended\",\"\")),\"\")","v":""}]
["B)",{"$f":"IF(M57=\"\",\"\",M57)","v":""},null,"lbs","+",{"$f":"IF(B77=\"\",\"\",IF(H69=\"\",0,H69))","v":""},null,"lbs","=",{"$f":"IF(B77=\"\",\"\",IFERROR(B77+F77,\"error\"))","v":""},null,"lbs"]
[null,"Total Manure P2O5 Available (Step 7B)",null,null,null,"Fertilizer P Credit (Step 9B)",null,null,null,"Total P Applied per acre"]

{"sheet":"P Worksheet","index":6,"n_rows":52,"n_cols":20,"rows_kept":52,"cut":false,"hidden":true,"merged":[[1,0,1,19],[50,1,50,2],[50,5,50,6],[50,9,50,10],[50,13,50,14],[50,17,50,18],[51,1,51,3],[51,5,51,7],[51,9,51,11],[51,13,51,15],[51,17,51,19],[47,1,47,2],[47,5,47,6],[47,9,47,10],[47,13,47,14],[47,17,47,18],[49,1,49,2],[49,5,49,6],[49,9,49,10],[49,13,49,14],[49,17,49,18],[43,1,43,3],[43,5,43,7],[43,9,43,11],[43,13,43,15],[43,17,43,19],[44,1,44,2],[44,5,44,6],[44,9,44,10],[44,13,44,14],[44,17,44,18],[39,1,39,2],[39,5,39,6],[39,9,39,10],[39,13,39,14],[39,17,39,18],[42,1,42,2],[42,5,42,6],[42,9,42,10],[42,13,42,14],[42,17,42,18],[37,1,37,2],[37,5,37,6],[37,9,37,10],[37,13,37,14],[37,17,37,18],[38,1,38,3],[38,5,38,7],[38,9,38,11],[38,13,38,15],[38,17,38,19],[33,1,33,3],[33,5,33,7],[33,9,33,11],[33,13,33,15],[33,17,33,19],[34,1,34,2],[34,5,34,6],[34,9,34,10],[34,13,34,14],[34,17,34,18],[29,1,29,2],[29,5,29,6],[29,9,29,10],[29,13,29,14],[29,17,29,18],[32,1,32,2],[32,5,32,6],[32,9,32,10],[32,13,32,14],[32,17,32,18],[27,1,27,2],[27,5,27,6],[27,9,27,10],[27,13,27,14],[27,17,27,18],[28,1,28,3],[28,5,28,7],[28,9,28,11],[28,13,28,15],[28,17,28,19],[23,1,23,3],[23,5,23,7],[23,9,23,11],[23,13,23,15],[23,17,23,19],[24,1,24,2],[24,5,24,6],[24,9,24,10],[24,13,24,14],[24,17,24,18],[19,1,19,2],[19,5,19,6],[19,9,19,10],[19,13,19,14],[19,17,19,18],[22,1,22,2],[22,5,22,6],[22,9,22,10],[22,13,22,14],[22,17,22,18],[15,1,15,8],[15,9,15,10],[15,11,15,13],[15,15,15,17],[15,18,15,19],[18,1,18,3],[18,5,18,7],[18,9,18,11],[18,13,18,15],[18,17,18,19],[13,1,13,8],[13,9,13,10],[13,11,13,13],[13,15,13,17],[13,18,13,19],[14,1,14,8],[14,9,14,10],[14,11,14,13],[14,15,14,17],[14,18,14,19],[11,1,11,8],[11,9,11,10],[11,11,11,13],[11,15,11,17],[11,18,11,19],[12,1,12,8],[12,9,12,10],[12,11,12,13],[12,15,12,17],[12,18,12,19],[9,1,9,8],[9,9,9,10],[9,11,9,13],[9,15,9,17],[9,18,9,19],[10,1,10,8],[10,9,10,10],[10,11,10,13],[10,15,10,17],[10,18,10,19],[7,1,7,8],[7,9,7,10],[7,11,7,13],[7,15,7,17],[7,18,7,19],[8,1,8,8],[8,9,8,10],[8,11,8,13],[8,15,8,17],[8,18,8,19],[5,1,5,8],[5,9,5,10],[5,11,5,13],[5,15,5,17],[5,18,5,19],[6,1,6,8],[6,9,6,10],[6,11,6,13],[6,15,6,17],[6,18,6,19],[3,1,3,8],[3,9,3,10],[3,11,3,13],[3,15,3,17],[3,18,3,19],[4,1,4,8],[4,9,4,10],[4,11,4,13],[4,15,4,17],[4,18,4,19]]}
["6-year Soil phosphorus management calculator"]
["Use this worksheet to determine if soil phosphorus levels are expected to be maintained (or reduced) over a 6 year period.\nCompletet the worksheet below using the typical crop rotations and nutirent applications employed by the farm.  \nUp to 5 different scenarios can be evaluated with this worksheet. You will need 6 years of records in order to determine the crop rotation; if not available, you will have to contact the farmer for more info on their typical rotation."]
["Manure Analysis Results"]
["Source ID","Description",null,null,null,null,null,null,null,"Animal",null,"N",null,null,"P","K",null,null,"Units"]
["Manure Source #1:"]
["Manure Source #2:"]
["Manure Source #3:"]
["Manure Source #4:"]
["Manure Source #5:"]
["Manure Source #6:"]
["Manure Source #7:"]
["Manure Source #8:"]
["Manure Source #9:"]
["Manure Source #10:"]
["Manure Source #11:"]
["Manure Source #12:"]
[]
[null,null,"Scenario 1",null,null,null,"Scenario 2",null,null,null,"Scenario 3",null,null,null,"Scenario 4",null,null,null,"Scenario 5"]
["Crop (Year 1)"]
["Yield",null,null,{"$f":"IF(ISERROR(LOOKUP(B19,'List Choices'!$D$3:$E$25)),\"\",LOOKUP(B19,'List Choices'!$D$3:$E$25))","v":""},null,null,null,{"$f":"IF(ISERROR(LOOKUP(F19,'List Choices'!$D$3:$E$25)),\"\",LOOKUP(F19,'List Choices'!$D$3:$E$25))","v":""},null,null,null,{"$f":"IF(ISERROR(LOOKUP(J19,'List Choices'!$D$3:$E$25)),\"\",LOOKUP(J19,'List Choices'!$D$3:$E$25))","v":""},null,null,null,{"$f":"IF(ISERROR(LOOKUP(N19,'List Choices'!$D$3:$E$25)),\"\",LOOKUP(N19,'List Choices'!$D$3:$E$25))","v":""},null,null,null,{"$f":"IF(ISERROR(LOOKUP(R19,'List Choices'!$D$3:$E$25)),\"\",LOOKUP(R19,'List Choices'!$D$3:$E$25))","v":""}]
["Manure Application\nSource (1-8) & Rate",null,null,{"$f":"IF(B21=\"\",\"\",IF((VLOOKUP(\"Manure Source #\"&B21&\":\",$A$5:$T$12,19,FALSE))=\"lbs/1000 gal\",\"gal\", IF((VLOOKUP(\"Manure Source #\"&B21&\":\",$A$5:$T$12,19,FALSE))=\"lbs/ton\",\"ton\",\"\")))","v":""},null,null,null,{"$f":"IF(F21=\"\",\"\",IF((VLOOKUP(\"Manure Source #\"&F21&\":\",$A$5:$T$12,19,FALSE))=\"lbs/1000 gal\",\"gal\", IF((VLOOKUP(\"Manure Source #\"&F21&\":\",$A$5:$T$12,19,FALSE))=\"lbs/ton\",\"ton\",\"\")))","v":""},null,null,null,{"$f":"IF(J21=\"\",\"\",IF((VLOOKUP(\"Manure Source #\"&J21&\":\",$A$5:$T$12,19,FALSE))=\"lbs/1000 gal\",\"gal\", IF((VLOOKUP(\"Manure Source #\"&J21&\":\",$A$5:$T$12,19,FALSE))=\"lbs/ton\",\"ton\",\"\")))","v":""},null,null,null,{"$f":"IF(N21=\"\",\"\",IF((VLOOKUP(\"Manure Source #\"&N21&\":\",$A$5:$T$12,19,FALSE))=\"lbs/1000 gal\",\"gal\", IF((VLOOKUP(\"Manure Source #\"&N21&\":\",$A$5:$T$12,19,FALSE))=\"lbs/ton\",\"ton\",\"\")))","v":""},null,null,null,{"$f":"IF(R21=\"\",\"\",IF((VLOOKUP(\"Manure Source #\"&R21&\":\",$A$5:$T$12,19,FALSE))=\"lbs/1000 gal\",\"gal\", IF((VLOOKUP(\"Manure Source #\"&R21&\":\",$A$5:$T$12,19,FALSE))=\"lbs/ton\",\"ton\",\"\")))","v":""}]
["2nd Manure Application",null,null,{"$f":"IF(B22=\"\",\"\",IF((VLOOKUP(\"Manure Source #\"&B22&\":\",$A$5:$T$12,19,FALSE))=\"lbs/1000 gal\",\"gal\", IF((VLOOKUP(\"Manure Source #\"&B22&\":\",$A$5:$T$12,19,FALSE))=\"lbs/ton\",\"ton\",\"\")))","v":""},null,null,null,{"$f":"IF(F22=\"\",\"\",IF((VLOOKUP(\"Manure Source #\"&F22&\":\",$A$5:$T$12,19,FALSE))=\"lbs/1000 gal\",\"gal\", IF((VLOOKUP(\"Manure Source #\"&F22&\":\",$A$5:$T$12,19,FALSE))=\"lbs/ton\",\"ton\",\"\")))","v":""},null,null,null,{"$f":"IF(J22=\"\",\"\",IF((VLOOKUP(\"Manure Source #\"&J22&\":\",$A$5:$T$12,19,FALSE))=\"lbs/1000 gal\",\"gal\", IF((VLOOKUP(\"Manure Source #\"&J22&\":\",$A$5:$T$12,19,FALSE))=\"lbs/ton\",\"ton\",\"\")))","v":""},null,null,null,{"$f":"IF(N22=\"\",\"\",IF((VLOOKUP(\"Manure Source #\"&N22&\":\",$A$5:$T$12,19,FALSE))=\"lbs/1000 gal\",\"gal\", IF((VLOOKUP(\"Manure Source #\"&N22&\":\",$A$5:$T$12,19,FALSE))=\"lbs/ton\",\"ton\",\"\")))","v":""},null,null,null,{"$f":"IF(R22=\"\",\"\",IF((VLOOKUP(\"Manure Source #\"&R22&\":\",$A$5:$T$12,19,FALSE))=\"lbs/1000 gal\",\"gal\", IF((VLOOKUP(\"Manure Source #\"&R22&\":\",$A$5:$T$12,19,FALSE))=\"lbs/ton\",\"ton\",\"\")))","v":""}]
["Fertilizer P (total)",null,null,{"$f":"IF(B20=\"\",\"\",\"lbs\")","v":""},null,null,null,{"$f":"IF(F20=\"\",\"\",\"lbs\")","v":""},null,null,null,{"$f":"IF(J20=\"\",\"\",\"lbs\")","v":""},null,null,null,{"$f":"IF(N20=\"\",\"\",\"lbs\")","v":""},null,null,null,{"$f":"IF(R20=\"\",\"\",\"lbs\")","v":""}]
["Crop (Year 2)"]
["Yield",null,null,{"$f":"IF(ISERROR(LOOKUP(B24,'List Choices'!$D$3:$E$25)),\"\",LOOKUP(B24,'List Choices'!$D$3:$E$25))","v":""},null,null,null,{"$f":"IF(ISERROR(LOOKUP(F24,'List Choices'!$D$3:$E$25)),\"\",LOOKUP(F24,'List Choices'!$D$3:$E$25))","v":""},null,null,null,{"$f":"IF(ISERROR(LOOKUP(J24,'List Choices'!$D$3:$E$25)),\"\",LOOKUP(J24,'List Choices'!$D$3:$E$25))","v":""},null,null,null,{"$f":"IF(ISERROR(LOOKUP(N24,'List Choices'!$D$3:$E$25)),\"\",LOOKUP(N24,'List Choices'!$D$3:$E$25))","v":""},null,null,null,{"$f":"IF(ISERROR(LOOKUP(R24,'List Choices'!$D$3:$E$25)),\"\",LOOKUP(R24,'List Choices'!$D$3:$E$25))","v":""}]
["Manure Application\nSource (1-8) & Rate",null,null,{"$f":"IF(B26=\"\",\"\",IF((VLOOKUP(\"Manure Source #\"&B26&\":\",$A$5:$T$12,19,FALSE))=\"lbs/1000 gal\",\"gal\", IF((VLOOKUP(\"Manure Source #\"&B26&\":\",$A$5:$T$12,19,FALSE))=\"lbs/ton\",\"ton\",\"\")))","v":""},null,null,null,{"$f":"IF(F26=\"\",\"\",IF((VLOOKUP(\"Manure Source #\"&F26&\":\",$A$5:$T$12,19,FALSE))=\"lbs/1000 gal\",\"gal\", IF((VLOOKUP(\"Manure Source #\"&F26&\":\",$A$5:$T$12,19,FALSE))=\"lbs/ton\",\"ton\",\"\")))","v":""},null,null,null,{"$f":"IF(J26=\"\",\"\",IF((VLOOKUP(\"Manure Source #\"&J26&\":\",$A$5:$T$12,19,FALSE))=\"lbs/1000 gal\",\"gal\", IF((VLOOKUP(\"Manure Source #\"&J26&\":\",$A$5:$T$12,19,FALSE))=\"lbs/ton\",\"ton\",\"\")))","v":""},null,null,null,{"$f":"IF(N26=\"\",\"\",IF((VLOOKUP(\"Manure Source #\"&N26&\":\",$A$5:$T$12,19,FALSE))=\"lbs/1000 gal\",\"gal\", IF((VLOOKUP(\"Manure Source #\"&N26&\":\",$A$5:$T$12,19,FALSE))=\"lbs/ton\",\"ton\",\"\")))","v":""},null,null,null,{"$f":"IF(R26=\"\",\"\",IF((VLOOKUP(\"Manure Source #\"&R26&\":\",$A$5:$T$12,19,FALSE))=\"lbs/1000 gal\",\"gal\", IF((VLOOKUP(\"Manure Source #\"&R26&\":\",$A$5:$T$12,19,FALSE))=\"lbs/ton\",\"ton\",\"\")))","v":""}]
["2nd Manure Application",null,null,{"$f":"IF(B27=\"\",\"\",IF((VLOOKUP(\"Manure Source #\"&B27&\":\",$A$5:$T$12,19,FALSE))=\"lbs/1000 gal\",\"gal\", IF((VLOOKUP(\"Manure Source #\"&B27&\":\",$A$5:$T$12,19,FALSE))=\"lbs/ton\",\"ton\",\"\")))","v":""},null,null,null,{"$f":"IF(F27=\"\",\"\",IF((VLOOKUP(\"Manure Source #\"&F27&\":\",$A$5:$T$12,19,FALSE))=\"lbs/1000 gal\",\"gal\", IF((VLOOKUP(\"Manure Source #\"&F27&\":\",$A$5:$T$12,19,FALSE))=\"lbs/ton\",\"ton\",\"\")))","v":""},null,null,null,{"$f":"IF(J27=\"\",\"\",IF((VLOOKUP(\"Manure Source #\"&J27&\":\",$A$5:$T$12,19,FALSE))=\"lbs/1000 gal\",\"gal\", IF((VLOOKUP(\"Manure Source #\"&J27&\":\",$A$5:$T$12,19,FALSE))=\"lbs/ton\",\"ton\",\"\")))","v":""},null,null,null,{"$f":"IF(N27=\"\",\"\",IF((VLOOKUP(\"Manure Source #\"&N27&\":\",$A$5:$T$12,19,FALSE))=\"lbs/1000 gal\",\"gal\", IF((VLOOKUP(\"Manure Source #\"&N27&\":\",$A$5:$T$12,19,FALSE))=\"lbs/ton\",\"ton\",\"\")))","v":""},null,null,null,{"$f":"IF(R27=\"\",\"\",IF((VLOOKUP(\"Manure Source #\"&R27&\":\",$A$5:$T$12,19,FALSE))=\"lbs/1000 gal\",\"gal\", IF((VLOOKUP(\"Manure Source #\"&R27&\":\",$A$5:$T$12,19,FALSE))=\"lbs/ton\",\"ton\",\"\")))","v":""}]
["Fertilizer P (total)",null,null,{"$f":"IF(B24=\"\",\"\",\"lbs\")","v":""},null,null,null,{"$f":"IF(F24=\"\",\"\",\"lbs\")","v":""},null,null,null,{"$f":"IF(J24=\"\",\"\",\"lbs\")","v":""},null,null,null,{"$f":"IF(N24=\"\",\"\",\"lbs\")","v":""},null,null,null,{"$f":"IF(R24=\"\",\"\",\"lbs\")","v":""}]
["Crop (Year 3)"]
["Yield",null,null,{"$f":"IF(ISERROR(LOOKUP(B29,'List Choices'!$D$3:$E$25)),\"\",LOOKUP(B29,'List Choices'!$D$3:$E$25))","v":""},null,null,null,{"$f":"IF(ISERROR(LOOKUP(F29,'List Choices'!$D$3:$E$25)),\"\",LOOKUP(F29,'List Choices'!$D$3:$E$25))","v":""},null,null,null,{"$f":"IF(ISERROR(LOOKUP(J29,'List Choices'!$D$3:$E$25)),\"\",LOOKUP(J29,'List Choices'!$D$3:$E$25))","v":""},null,null,null,{"$f":"IF(ISERROR(LOOKUP(N29,'List Choices'!$D$3:$E$25)),\"\",LOOKUP(N29,'List Choices'!$D$3:$E$25))","v":""},null,null,null,{"$f":"IF(ISERROR(LOOKUP(R29,'List Choices'!$D$3:$E$25)),\"\",LOOKUP(R29,'List Choices'!$D$3:$E$25))","v":""}]
["Manure Application\nSource (1-8) & Rate",null,null,{"$f":"IF(B31=\"\",\"\",IF((VLOOKUP(\"Manure Source #\"&B31&\":\",$A$5:$T$12,19,FALSE))=\"lbs/1000 gal\",\"gal\", IF((VLOOKUP(\"Manure Source #\"&B31&\":\",$A$5:$T$12,19,FALSE))=\"lbs/ton\",\"ton\",\"\")))","v":""},null,null,null,{"$f":"IF(F31=\"\",\"\",IF((VLOOKUP(\"Manure Source #\"&F31&\":\",$A$5:$T$12,19,FALSE))=\"lbs/1000 gal\",\"gal\", IF((VLOOKUP(\"Manure Source #\"&F31&\":\",$A$5:$T$12,19,FALSE))=\"lbs/ton\",\"ton\",\"\")))","v":""},null,null,null,{"$f":"IF(J31=\"\",\"\",IF((VLOOKUP(\"Manure Source #\"&J31&\":\",$A$5:$T$12,19,FALSE))=\"lbs/1000 gal\",\"gal\", IF((VLOOKUP(\"Manure Source #\"&J31&\":\",$A$5:$T$12,19,FALSE))=\"lbs/ton\",\"ton\",\"\")))","v":""},null,null,null,{"$f":"IF(N31=\"\",\"\",IF((VLOOKUP(\"Manure Source #\"&N31&\":\",$A$5:$T$12,19,FALSE))=\"lbs/1000 gal\",\"gal\", IF((VLOOKUP(\"Manure Source #\"&N31&\":\",$A$5:$T$12,19,FALSE))=\"lbs/ton\",\"ton\",\"\")))","v":""},null,null,null,{"$f":"IF(R31=\"\",\"\",IF((VLOOKUP(\"Manure Source #\"&R31&\":\",$A$5:$T$12,19,FALSE))=\"lbs/1000 gal\",\"gal\", IF((VLOOKUP(\"Manure Source #\"&R31&\":\",$A$5:$T$12,19,FALSE))=\"lbs/ton\",\"ton\",\"\")))","v":""}]
["2nd Manure Application",null,null,{"$f":"IF(B32=\"\",\"\",IF((VLOOKUP(\"Manure Source #\"&B32&\":\",$A$5:$T$12,19,FALSE))=\"lbs/1000 gal\",\"gal\", IF((VLOOKUP(\"Manure Source #\"&B32&\":\",$A$5:$T$12,19,FALSE))=\"lbs/ton\",\"ton\",\"\")))","v":""},null,null,null,{"$f":"IF(F32=\"\",\"\",IF((VLOOKUP(\"Manure Source #\"&F32&\":\",$A$5:$T$12,19,FALSE))=\"lbs/1000 gal\",\"gal\", IF((VLOOKUP(\"Manure Source #\"&F32&\":\",$A$5:$T$12,19,FALSE))=\"lbs/ton\",\"ton\",\"\")))","v":""},null,null,null,{"$f":"IF(J32=\"\",\"\",IF((VLOOKUP(\"Manure Source #\"&J32&\":\",$A$5:$T$12,19,FALSE))=\"lbs/1000 gal\",\"gal\", IF((VLOOKUP(\"Manure Source #\"&J32&\":\",$A$5:$T$12,19,FALSE))=\"lbs/ton\",\"ton\",\"\")))","v":""},null,null,null,{"$f":"IF(N32=\"\",\"\",IF((VLOOKUP(\"Manure Source #\"&N32&\":\",$A$5:$T$12,19,FALSE))=\"lbs/1000 gal\",\"gal\", IF((VLOOKUP(\"Manure Source #\"&N32&\":\",$A$5:$T$12,19,FALSE))=\"lbs/ton\",\"ton\",\"\")))","v":""},null,null,null,{"$f":"IF(R32=\"\",\"\",IF((VLOOKUP(\"Manure Source #\"&R32&\":\",$A$5:$T$12,19,FALSE))=\"lbs/1000 gal\",\"gal\", IF((VLOOKUP(\"Manure Source #\"&R32&\":\",$A$5:$T$12,19,FALSE))=\"lbs/ton\",\"ton\",\"\")))","v":""}]
["Fertilizer P (total)",null,null,{"$f":"IF(B29=\"\",\"\",\"lbs\")","v":""},null,null,null,{"$f":"IF(F29=\"\",\"\",\"lbs\")","v":""},null,null,null,{"$f":"IF(J29=\"\",\"\",\"lbs\")","v":""},null,null,null,{"$f":"IF(N29=\"\",\"\",\"lbs\")","v":""},null,null,null,{"$f":"IF(R29=\"\",\"\",\"lbs\")","v":""}]
["Crop (Year 4)"]
["Yield",null,null,{"$f":"IF(ISERROR(LOOKUP(B34,'List Choices'!$D$3:$E$25)),\"\",LOOKUP(B34,'List Choices'!$D$3:$E$25))","v":""},null,null,null,{"$f":"IF(ISERROR(LOOKUP(F34,'List Choices'!$D$3:$E$25)),\"\",LOOKUP(F34,'List Choices'!$D$3:$E$25))","v":""},null,null,null,{"$f":"IF(ISERROR(LOOKUP(J34,'List Choices'!$D$3:$E$25)),\"\",LOOKUP(J34,'List Choices'!$D$3:$E$25))","v":""},null,null,null,{"$f":"IF(ISERROR(LOOKUP(N34,'List Choices'!$D$3:$E$25)),\"\",LOOKUP(N34,'List Choices'!$D$3:$E$25))","v":""},null,null,null,{"$f":"IF(ISERROR(LOOKUP(R34,'List Choices'!$D$3:$E$25)),\"\",LOOKUP(R34,'List Choices'!$D$3:$E$25))","v":""}]
["Manure Application\nSource (1-8) & Rate",null,null,{"$f":"IF(B36=\"\",\"\",IF((VLOOKUP(\"Manure Source #\"&B36&\":\",$A$5:$T$12,19,FALSE))=\"lbs/1000 gal\",\"gal\", IF((VLOOKUP(\"Manure Source #\"&B36&\":\",$A$5:$T$12,19,FALSE))=\"lbs/ton\",\"ton\",\"\")))","v":""},null,null,null,{"$f":"IF(F36=\"\",\"\",IF((VLOOKUP(\"Manure Source #\"&F36&\":\",$A$5:$T$12,19,FALSE))=\"lbs/1000 gal\",\"gal\", IF((VLOOKUP(\"Manure Source #\"&F36&\":\",$A$5:$T$12,19,FALSE))=\"lbs/ton\",\"ton\",\"\")))","v":""},null,null,null,{"$f":"IF(J36=\"\",\"\",IF((VLOOKUP(\"Manure Source #\"&J36&\":\",$A$5:$T$12,19,FALSE))=\"lbs/1000 gal\",\"gal\", IF((VLOOKUP(\"Manure Source #\"&J36&\":\",$A$5:$T$12,19,FALSE))=\"lbs/ton\",\"ton\",\"\")))","v":""},null,null,null,{"$f":"IF(N36=\"\",\"\",IF((VLOOKUP(\"Manure Source #\"&N36&\":\",$A$5:$T$12,19,FALSE))=\"lbs/1000 gal\",\"gal\", IF((VLOOKUP(\"Manure Source #\"&N36&\":\",$A$5:$T$12,19,FALSE))=\"lbs/ton\",\"ton\",\"\")))","v":""},null,null,null,{"$f":"IF(R36=\"\",\"\",IF((VLOOKUP(\"Manure Source #\"&R36&\":\",$A$5:$T$12,19,FALSE))=\"lbs/1000 gal\",\"gal\", IF((VLOOKUP(\"Manure Source #\"&R36&\":\",$A$5:$T$12,19,FALSE))=\"lbs/ton\",\"ton\",\"\")))","v":""}]
["2nd Manure Application",null,null,{"$f":"IF(B37=\"\",\"\",IF((VLOOKUP(\"Manure Source #\"&B37&\":\",$A$5:$T$12,19,FALSE))=\"lbs/1000 gal\",\"gal\", IF((VLOOKUP(\"Manure Source #\"&B37&\":\",$A$5:$T$12,19,FALSE))=\"lbs/ton\",\"ton\",\"\")))","v":""},null,null,null,{"$f":"IF(F37=\"\",\"\",IF((VLOOKUP(\"Manure Source #\"&F37&\":\",$A$5:$T$12,19,FALSE))=\"lbs/1000 gal\",\"gal\", IF((VLOOKUP(\"Manure Source #\"&F37&\":\",$A$5:$T$12,19,FALSE))=\"lbs/ton\",\"ton\",\"\")))","v":""},null,null,null,{"$f":"IF(J37=\"\",\"\",IF((VLOOKUP(\"Manure Source #\"&J37&\":\",$A$5:$T$12,19,FALSE))=\"lbs/1000 gal\",\"gal\", IF((VLOOKUP(\"Manure Source #\"&J37&\":\",$A$5:$T$12,19,FALSE))=\"lbs/ton\",\"ton\",\"\")))","v":""},null,null,null,{"$f":"IF(N37=\"\",\"\",IF((VLOOKUP(\"Manure Source #\"&N37&\":\",$A$5:$T$12,19,FALSE))=\"lbs/1000 gal\",\"gal\", IF((VLOOKUP(\"Manure Source #\"&N37&\":\",$A$5:$T$12,19,FALSE))=\"lbs/ton\",\"ton\",\"\")))","v":""},null,null,null,{"$f":"IF(R37=\"\",\"\",IF((VLOOKUP(\"Manure Source #\"&R37&\":\",$A$5:$T$12,19,FALSE))=\"lbs/1000 gal\",\"gal\", IF((VLOOKUP(\"Manure Source #\"&R37&\":\",$A$5:$T$12,19,FALSE))=\"lbs/ton\",\"ton\",\"\")))","v":""}]
["Fertilizer P (total)",null,null,{"$f":"IF(B34=\"\",\"\",\"lbs\")","v":""},null,null,null,{"$f":"IF(F34=\"\",\"\",\"lbs\")","v":""},null,null,null,{"$f":"IF(J34=\"\",\"\",\"lbs\")","v":""},null,null,null,{"$f":"IF(N34=\"\",\"\",\"lbs\")","v":""},null,null,null,{"$f":"IF(R34=\"\",\"\",\"lbs\")","v":""}]
["Crop (Year 5)"]
["Yield",null,null,{"$f":"IF(ISERROR(LOOKUP(B39,'List Choices'!$D$3:$E$25)),\"\",LOOKUP(B39,'List Choices'!$D$3:$E$25))","v":""},null,null,null,{"$f":"IF(ISERROR(LOOKUP(F39,'List Choices'!$D$3:$E$25)),\"\",LOOKUP(F39,'List Choices'!$D$3:$E$25))","v":""},null,null,null,{"$f":"IF(ISERROR(LOOKUP(J39,'List Choices'!$D$3:$E$25)),\"\",LOOKUP(J39,'List Choices'!$D$3:$E$25))","v":""},null,null,null,{"$f":"IF(ISERROR(LOOKUP(N39,'List Choices'!$D$3:$E$25)),\"\",LOOKUP(N39,'List Choices'!$D$3:$E$25))","v":""},null,null,null,{"$f":"IF(ISERROR(LOOKUP(R39,'List Choices'!$D$3:$E$25)),\"\",LOOKUP(R39,'List Choices'!$D$3:$E$25))","v":""}]
["Manure Application\nSource (1-8) & Rate",null,null,{"$f":"IF(B41=\"\",\"\",IF((VLOOKUP(\"Manure Source #\"&B41&\":\",$A$5:$T$12,19,FALSE))=\"lbs/1000 gal\",\"gal\", IF((VLOOKUP(\"Manure Source #\"&B41&\":\",$A$5:$T$12,19,FALSE))=\"lbs/ton\",\"ton\",\"\")))","v":""},null,null,null,{"$f":"IF(F41=\"\",\"\",IF((VLOOKUP(\"Manure Source #\"&F41&\":\",$A$5:$T$12,19,FALSE))=\"lbs/1000 gal\",\"gal\", IF((VLOOKUP(\"Manure Source #\"&F41&\":\",$A$5:$T$12,19,FALSE))=\"lbs/ton\",\"ton\",\"\")))","v":""},null,null,null,{"$f":"IF(J41=\"\",\"\",IF((VLOOKUP(\"Manure Source #\"&J41&\":\",$A$5:$T$12,19,FALSE))=\"lbs/1000 gal\",\"gal\", IF((VLOOKUP(\"Manure Source #\"&J41&\":\",$A$5:$T$12,19,FALSE))=\"lbs/ton\",\"ton\",\"\")))","v":""},null,null,null,{"$f":"IF(N41=\"\",\"\",IF((VLOOKUP(\"Manure Source #\"&N41&\":\",$A$5:$T$12,19,FALSE))=\"lbs/1000 gal\",\"gal\", IF((VLOOKUP(\"Manure Source #\"&N41&\":\",$A$5:$T$12,19,FALSE))=\"lbs/ton\",\"ton\",\"\")))","v":""},null,null,null,{"$f":"IF(R41=\"\",\"\",IF((VLOOKUP(\"Manure Source #\"&R41&\":\",$A$5:$T$12,19,FALSE))=\"lbs/1000 gal\",\"gal\", IF((VLOOKUP(\"Manure Source #\"&R41&\":\",$A$5:$T$12,19,FALSE))=\"lbs/ton\",\"ton\",\"\")))","v":""}]
["2nd Manure Application",null,null,{"$f":"IF(B42=\"\",\"\",IF((VLOOKUP(\"Manure Source #\"&B42&\":\",$A$5:$T$12,19,FALSE))=\"lbs/1000 gal\",\"gal\", IF((VLOOKUP(\"Manure Source #\"&B42&\":\",$A$5:$T$12,19,FALSE))=\"lbs/ton\",\"ton\",\"\")))","v":""},null,null,null,{"$f":"IF(F42=\"\",\"\",IF((VLOOKUP(\"Manure Source #\"&F42&\":\",$A$5:$T$12,19,FALSE))=\"lbs/1000 gal\",\"gal\", IF((VLOOKUP(\"Manure Source #\"&F42&\":\",$A$5:$T$12,19,FALSE))=\"lbs/ton\",\"ton\",\"\")))","v":""},null,null,null,{"$f":"IF(J42=\"\",\"\",IF((VLOOKUP(\"Manure Source #\"&J42&\":\",$A$5:$T$12,19,FALSE))=\"lbs/1000 gal\",\"gal\", IF((VLOOKUP(\"Manure Source #\"&J42&\":\",$A$5:$T$12,19,FALSE))=\"lbs/ton\",\"ton\",\"\")))","v":""},null,null,null,{"$f":"IF(N42=\"\",\"\",IF((VLOOKUP(\"Manure Source #\"&N42&\":\",$A$5:$T$12,19,FALSE))=\"lbs/1000 gal\",\"gal\", IF((VLOOKUP(\"Manure Source #\"&N42&\":\",$A$5:$T$12,19,FALSE))=\"lbs/ton\",\"ton\",\"\")))","v":""},null,null,null,{"$f":"IF(R42=\"\",\"\",IF((VLOOKUP(\"Manure Source #\"&R42&\":\",$A$5:$T$12,19,FALSE))=\"lbs/1000 gal\",\"gal\", IF((VLOOKUP(\"Manure Source #\"&R42&\":\",$A$5:$T$12,19,FALSE))=\"lbs/ton\",\"ton\",\"\")))","v":""}]
["Fertilizer P (total)",null,null,{"$f":"IF(B39=\"\",\"\",\"lbs\")","v":""},null,null,null,{"$f":"IF(F39=\"\",\"\",\"lbs\")","v":""},null,null,null,{"$f":"IF(J39=\"\",\"\",\"lbs\")","v":""},null,null,null,{"$f":"IF(N39=\"\",\"\",\"lbs\")","v":""},null,null,null,{"$f":"IF(R39=\"\",\"\",\"lbs\")","v":""}]
["Crop (Year 6)"]
["Yield",null,null,{"$f":"IF(ISERROR(LOOKUP(B44,'List Choices'!$D$3:$E$25)),\"\",LOOKUP(B44,'List Choices'!$D$3:$E$25))","v":""},null,null,null,{"$f":"IF(ISERROR(LOOKUP(F44,'List Choices'!$D$3:$E$25)),\"\",LOOKUP(F44,'List Choices'!$D$3:$E$25))","v":""},null,null,null,{"$f":"IF(ISERROR(LOOKUP(J44,'List Choices'!$D$3:$E$25)),\"\",LOOKUP(J44,'List Choices'!$D$3:$E$25))","v":""},null,null,null,{"$f":"IF(ISERROR(LOOKUP(N44,'List Choices'!$D$3:$E$25)),\"\",LOOKUP(N44,'List Choices'!$D$3:$E$25))","v":""},null,null,null,{"$f":"IF(ISERROR(LOOKUP(R44,'List Choices'!$D$3:$E$25)),\"\",LOOKUP(R44,'List Choices'!$D$3:$E$25))","v":""}]
["Manure Application\nSource (1-8) & Rate",null,null,{"$f":"IF(B46=\"\",\"\",IF((VLOOKUP(\"Manure Source #\"&B46&\":\",$A$5:$T$12,19,FALSE))=\"lbs/1000 gal\",\"gal\", IF((VLOOKUP(\"Manure Source #\"&B46&\":\",$A$5:$T$12,19,FALSE))=\"lbs/ton\",\"ton\",\"\")))","v":""},null,null,null,{"$f":"IF(F46=\"\",\"\",IF((VLOOKUP(\"Manure Source #\"&F46&\":\",$A$5:$T$12,19,FALSE))=\"lbs/1000 gal\",\"gal\", IF((VLOOKUP(\"Manure Source #\"&F46&\":\",$A$5:$T$12,19,FALSE))=\"lbs/ton\",\"ton\",\"\")))","v":""},null,null,null,{"$f":"IF(J46=\"\",\"\",IF((VLOOKUP(\"Manure Source #\"&J46&\":\",$A$5:$T$12,19,FALSE))=\"lbs/1000 gal\",\"gal\", IF((VLOOKUP(\"Manure Source #\"&J46&\":\",$A$5:$T$12,19,FALSE))=\"lbs/ton\",\"ton\",\"\")))","v":""},null,null,null,{"$f":"IF(N46=\"\",\"\",IF((VLOOKUP(\"Manure Source #\"&N46&\":\",$A$5:$T$12,19,FALSE))=\"lbs/1000 gal\",\"gal\", IF((VLOOKUP(\"Manure Source #\"&N46&\":\",$A$5:$T$12,19,FALSE))=\"lbs/ton\",\"ton\",\"\")))","v":""},null,null,null,{"$f":"IF(R46=\"\",\"\",IF((VLOOKUP(\"Manure Source #\"&R46&\":\",$A$5:$T$12,19,FALSE))=\"lbs/1000 gal\",\"gal\", IF((VLOOKUP(\"Manure Source #\"&R46&\":\",$A$5:$T$12,19,FALSE))=\"lbs/ton\",\"ton\",\"\")))","v":""}]
["2nd Manure Application",null,null,{"$f":"IF(B47=\"\",\"\",IF((VLOOKUP(\"Manure Source #\"&B47&\":\",$A$5:$T$12,19,FALSE))=\"lbs/1000 gal\",\"gal\", IF((VLOOKUP(\"Manure Source #\"&B47&\":\",$A$5:$T$12,19,FALSE))=\"lbs/ton\",\"ton\",\"\")))","v":""},null,null,null,{"$f":"IF(F47=\"\",\"\",IF((VLOOKUP(\"Manure Source #\"&F47&\":\",$A$5:$T$12,19,FALSE))=\"lbs/1000 gal\",\"gal\", IF((VLOOKUP(\"Manure Source #\"&F47&\":\",$A$5:$T$12,19,FALSE))=\"lbs/ton\",\"ton\",\"\")))","v":""},null,null,null,{"$f":"IF(J47=\"\",\"\",IF((VLOOKUP(\"Manure Source #\"&J47&\":\",$A$5:$T$12,19,FALSE))=\"lbs/1000 gal\",\"gal\", IF((VLOOKUP(\"Manure Source #\"&J47&\":\",$A$5:$T$12,19,FALSE))=\"lbs/ton\",\"ton\",\"\")))","v":""},null,null,null,{"$f":"IF(N47=\"\",\"\",IF((VLOOKUP(\"Manure Source #\"&N47&\":\",$A$5:$T$12,19,FALSE))=\"lbs/1000 gal\",\"gal\", IF((VLOOKUP(\"Manure Source #\"&N47&\":\",$A$5:$T$12,19,FALSE))=\"lbs/ton\",\"ton\",\"\")))","v":""},null,null,null,{"$f":"IF(R47=\"\",\"\",IF((VLOOKUP(\"Manure Source #\"&R47&\":\",$A$5:$T$12,19,FALSE))=\"lbs/1000 gal\",\"gal\", IF((VLOOKUP(\"Manure Source #\"&R47&\":\",$A$5:$T$12,19,FALSE))=\"lbs/ton\",\"ton\",\"\")))","v":""}]
["Fertilizer P (total)",null,null,{"$f":"IF(B44=\"\",\"\",\"lbs\")","v":""},null,null,null,{"$f":"IF(F44=\"\",\"\",\"lbs\")","v":""},null,null,null,{"$f":"IF(J44=\"\",\"\",\"lbs\")","v":""},null,null,null,{"$f":"IF(N44=\"\",\"\",\"lbs\")","v":""},null,null,null,{"$f":"IF(R44=\"\",\"\",\"lbs\")","v":""}]
["Results"]
["P Applied over 6 Yrs",{"$f":"IF(OR(B19=\"\",B24=\"\",B29=\"\",B34=\"\",B39=\"\",B44=\"\"),\"\",Manure_Nutrients(B46,\"\",C46,\"P\")+Manure_Nutrients(B47,\"\",C47,\"P\")+B48+Manure_Nutrients(B41,\"\",C41,\"P\")+Manure_Nutrients(B42,\"\",C42,\"P\")+B43+Manure_Nutrients(B36,\"\",C36,\"P\")+Manure_Nutrients(B37,\"\",C37,\"P\")+B38+Manure_Nutrients(B31,\"\",C31,\"P\")+Manure_Nutrients(B32,\"\",C32,\"P\")+B33+Manure_Nutrients(B26,\"\",C26,\"P\")+Manure_Nutrients(B27,\"\",C27,\"P\")+B28+Manure_Nutrients(B21,\"\",C21,\"P\")+Manure_Nutrients(B22,\"\",C22,\"P\")+B23)","v":""},null,"lbs",null,{"$f":"IF(OR(F19=\"\",F24=\"\",F29=\"\",F34=\"\",F39=\"\",F44=\"\"),\"\",Manure_Nutrients(F46,\"\",G46,\"P\")+Manure_Nutrients(F47,\"\",G47,\"P\")+F48+Manure_Nutrients(F41,\"\",G41,\"P\")+Manure_Nutrients(F42,\"\",G42,\"P\")+F43+Manure_Nutrients(F36,\"\",G36,\"P\")+Manure_Nutrients(F37,\"\",G37,\"P\")+F38+Manure_Nutrients(F31,\"\",G31,\"P\")+Manure_Nutrients(F32,\"\",G32,\"P\")+F33+Manure_Nutrients(F26,\"\",G26,\"P\")+Manure_Nutrients(F27,\"\",G27,\"P\")+F28+Manure_Nutrients(F21,\"\",G21,\"P\")+Manure_Nutrients(F22,\"\",G22,\"P\")+F23)","v":""},null,"lbs",null,{"$f":"IF(OR(J19=\"\",J24=\"\",J29=\"\",J34=\"\",J39=\"\",J44=\"\"),\"\",Manure_Nutrients(J46,\"\",K46,\"P\")+Manure_Nutrients(J47,\"\",K47,\"P\")+J48+Manure_Nutrients(J41,\"\",K41,\"P\")+Manure_Nutrients(J42,\"\",K42,\"P\")+J43+Manure_Nutrients(J36,\"\",K36,\"P\")+Manure_Nutrients(J37,\"\",K37,\"P\")+J38+Manure_Nutrients(J31,\"\",K31,\"P\")+Manure_Nutrients(J32,\"\",K32,\"P\")+J33+Manure_Nutrients(J26,\"\",K26,\"P\")+Manure_Nutrients(J27,\"\",K27,\"P\")+J28+Manure_Nutrients(J21,\"\",K21,\"P\")+Manure_Nutrients(J22,\"\",K22,\"P\")+J23)","v":""},null,"lbs",null,{"$f":"IF(OR(N19=\"\",N24=\"\",N29=\"\",N34=\"\",N39=\"\",N44=\"\"),\"\",Manure_Nutrients(N46,\"\",O46,\"P\")+Manure_Nutrients(N47,\"\",O47,\"P\")+N48+Manure_Nutrients(N41,\"\",O41,\"P\")+Manure_Nutrients(N42,\"\",O42,\"P\")+N43+Manure_Nutrients(N36,\"\",O36,\"P\")+Manure_Nutrients(N37,\"\",O37,\"P\")+N38+Manure_Nutrients(N31,\"\",O31,\"P\")+Manure_Nutrients(N32,\"\",O32,\"P\")+N33+Manure_Nutrients(N26,\"\",O26,\"P\")+Manure_Nutrients(N27,\"\",O27,\"P\")+N28+Manure_Nutrients(N21,\"\",O21,\"P\")+Manure_Nutrients(N22,\"\",O22,\"P\")+N23)","v":""},null,"lbs",null,{"$f":"IF(OR(R19=\"\",R24=\"\",R29=\"\",R34=\"\",R39=\"\",R44=\"\"),\"\",Manure_Nutrients(R46,\"\",S46,\"P\")+Manure_Nutrients(R47,\"\",S47,\"P\")+R48+Manure_Nutrients(R41,\"\",S41,\"P\")+Manure_Nutrients(R42,\"\",S42,\"P\")+R43+Manure_Nutrients(R36,\"\",S36,\"P\")+Manure_Nutrients(R37,\"\",S37,\"P\")+R38+Manure_Nutrients(R31,\"\",S31,\"P\")+Manure_Nutrients(R32,\"\",S32,\"P\")+R33+Manure_Nutrients(R26,\"\",S26,\"P\")+Manure_Nutrients(R27,\"\",S27,\"P\")+R28+Manure_Nutrients(R21,\"\",S21,\"P\")+Manure_Nutrients(R22,\"\",S22,\"P\")+R23)","v":""},null,"lbs"]
["P Removed over 6 Yrs",{"$f":"IF(OR(B19=\"\",B24=\"\",B29=\"\",B34=\"\",B39=\"\",B44=\"\"),\"\",B20*VLOOKUP(B19,HighP_Removal,2,FALSE)+B25*VLOOKUP(B24,HighP_Removal,2,FALSE)+B30*VLOOKUP(B29,HighP_Removal,2,FALSE)+B35*VLOOKUP(B34,HighP_Removal,2,FALSE)+B40*VLOOKUP(B39,HighP_Removal,2,FALSE)+B45*VLOOKUP(B44,HighP_Removal,2,FALSE))","v":""},null,"lbs",null,{"$f":"IF(OR(F19=\"\",F24=\"\",F29=\"\",F34=\"\",F39=\"\",F44=\"\"),\"\",F20*VLOOKUP(F19,HighP_Removal,2,FALSE)+F25*VLOOKUP(F24,HighP_Removal,2,FALSE)+F30*VLOOKUP(F29,HighP_Removal,2,FALSE)+F35*VLOOKUP(F34,HighP_Removal,2,FALSE)+F40*VLOOKUP(F39,HighP_Removal,2,FALSE)+F45*VLOOKUP(F44,HighP_Removal,2,FALSE))","v":""},null,"lbs",null,{"$f":"IF(OR(J19=\"\",J24=\"\",J29=\"\",J34=\"\",J39=\"\",J44=\"\"),\"\",J20*VLOOKUP(J19,HighP_Removal,2,FALSE)+J25*VLOOKUP(J24,HighP_Removal,2,FALSE)+J30*VLOOKUP(J29,HighP_Removal,2,FALSE)+J35*VLOOKUP(J34,HighP_Removal,2,FALSE)+J40*VLOOKUP(J39,HighP_Removal,2,FALSE)+J45*VLOOKUP(J44,HighP_Removal,2,FALSE))","v":""},null,"lbs",null,{"$f":"IF(OR(N19=\"\",N24=\"\",N29=\"\",N34=\"\",N39=\"\",N44=\"\"),\"\",N20*VLOOKUP(N19,HighP_Removal,2,FALSE)+N25*VLOOKUP(N24,HighP_Removal,2,FALSE)+N30*VLOOKUP(N29,HighP_Removal,2,FALSE)+N35*VLOOKUP(N34,HighP_Removal,2,FALSE)+N40*VLOOKUP(N39,HighP_Removal,2,FALSE)+N45*VLOOKUP(N44,HighP_Removal,2,FALSE))","v":""},null,"lbs",null,{"$f":"IF(OR(R19=\"\",R24=\"\",R29=\"\",R34=\"\",R39=\"\",R44=\"\"),\"\",R20*VLOOKUP(R19,HighP_Removal,2,FALSE)+R25*VLOOKUP(R24,HighP_Removal,2,FALSE)+R30*VLOOKUP(R29,HighP_Removal,2,FALSE)+R35*VLOOKUP(R34,HighP_Removal,2,FALSE)+R40*VLOOKUP(R39,HighP_Removal,2,FALSE)+R45*VLOOKUP(R44,HighP_Removal,2,FALSE))","v":""},null,"lbs"]
["Will Rotation Build Soil Phosphorus Levels?",{"$f":"IF(OR(B19=\"\",B24=\"\",B29=\"\",B34=\"\",B39=\"\",B44=\"\"),\"\",IF(B50>B51,\"Yes - Modify the Rotation\", \"No\"))","v":""},null,null,null,{"$f":"IF(OR(F19=\"\",F24=\"\",F29=\"\",F34=\"\",F39=\"\",F44=\"\"),\"\",IF(F50>F51,\"Yes - Modify the Rotation\", \"No\"))","v":""},null,null,null,{"$f":"IF(OR(J19=\"\",J24=\"\",J29=\"\",J34=\"\",J39=\"\",J44=\"\"),\"\",IF(J50>J51,\"Yes - Modify the Rotation\", \"No\"))","v":""},null,null,null,{"$f":"IF(OR(N19=\"\",N24=\"\",N29=\"\",N34=\"\",N39=\"\",N44=\"\"),\"\",IF(N50>N51,\"Yes - Modify the Rotation\", \"No\"))","v":""},null,null,null,{"$f":"IF(OR(R19=\"\",R24=\"\",R29=\"\",R34=\"\",R39=\"\",R44=\"\"),\"\",IF(R50>R51,\"Yes - Modify the Rotation\", \"No\"))","v":""}]