{"text_format":"1","workbook":"xlsx","n_sheets":9,"sheets":["Instructions","Boilers (fuel use)","Engines (fuel use)","Engines (hours)","VOC-containing","Eligibility","Sulfur tracking","Boilers unit info","Data validation"],"not_rendered":{"charts":0,"images":1,"macros":0,"external_links":0,"defined_names":11,"comments":0,"pivot_tables":0},"unopened":[],"bounds":{"document_bytes":16777216,"sheet_cells":100000,"rows_first":2000,"rows_last":500,"rows_between":2000,"halvings":0,"cell_chars":16384,"cell_head_chars":4096},"cells_cut":0,"cells_raw":0,"read":"whole","date_system":"1900"}

{"sheet":"Instructions","index":0,"n_rows":36,"n_cols":15,"rows_kept":36,"cut":false,"hidden":false,"merged":[[18,2,18,5],[5,1,6,14],[14,2,14,14],[11,2,11,14],[12,2,12,14],[13,2,13,14],[9,1,9,14],[10,1,10,14],[7,2,7,14],[0,6,1,14],[28,1,28,14],[29,1,29,14],[30,1,30,14],[31,1,31,14],[21,1,21,14],[22,2,22,14],[23,2,23,14],[24,2,24,14],[8,2,8,14],[25,2,25,14],[26,2,26,14],[0,1,3,5],[4,1,4,14],[16,1,17,14],[18,7,18,9],[19,10,19,14],[33,2,33,3],[33,4,33,14],[35,1,35,3],[35,4,35,13],[32,2,32,3],[32,5,32,8],[32,10,32,14]]}
[null,null,null,null,null,null,"Registration Option C Air Permit\nEligibility and recordkeeping"]
[]
[null,null,null,null,null,null,null,null,null,null,null,null,null,null,"Air Emissions Calculator"]
[null,null,null,null,null,null,null,null,null,null,null,null,null,null,"p-sbap5-33  •  6/6/23"]
[null,"Instructions"]
[null,"1) Fill out the blue tabs for any boilers, engines (by fuel type or operation hours), and VOC-containing material purchase or use, whichever was used\n    in your permit application for calculations. Follow the instructions on each blue tab and enter the necessary information."]
{"$rows_left_out":31}
{"sheet":"Boilers (fuel use)","index":1,"n_rows":72,"n_cols":33,"rows_kept":72,"cut":false,"hidden":false,"merged":[[7,29,7,32],[9,27,10,27],[9,28,10,28],[9,29,10,29],[9,30,10,30],[9,31,10,31],[9,32,10,32],[1,27,1,32],[2,27,3,32],[5,28,5,29],[5,30,5,32],[6,30,6,32],[6,23,6,25],[7,22,7,25],[9,20,10,20],[9,21,10,21],[9,22,10,22],[9,23,10,23],[9,24,10,24],[9,25,10,25],[1,1,1,11],[1,20,1,25],[2,20,3,25],[5,21,5,22],[5,23,5,25],[1,13,1,18],[2,13,3,18],[6,2,6,11],[7,3,7,11],[8,4,8,11],[2,1,4,11],[19,4,19,11],[18,4,18,11],[13,5,13,11],[14,3,14,11],[16,2,16,11],[11,5,12,11],[23,2,23,11],[24,3,24,11],[25,3,26,11],[20,4,20,11],[21,3,21,11],[9,13,10,13],[9,14,10,14],[9,15,10,15],[9,4,9,11],[10,4,10,11],[9,18,10,18],[5,14,5,15],[5,16,5,18],[6,16,6,18],[7,15,7,18],[9,16,10,16],[9,17,10,17]]}
[null,null,null,null,null,null,null,null,null,null,null,{"$f":"Instructions!O4","v":"p-sbap5-33  •  6/6/23"}]
[null,"Boilers: by fuel use",null,null,null,null,null,null,null,null,null,null,null,"Boiler fuel 1: monthly and 12-month rolling totals",null,null,null,null,null,null,"Boiler fuel 2: monthly and 12-month rolling totals",null,null,null,null,null,null,"Boiler fuel 3: monthly and 12-month rolling totals"]
[null,"Use this tab to track emissions for boilers, furnaces, space heaters, or other indirect heat exchangers by the type and amount of fuel purchased or used. Do not include fuel burned in boilers, furnaces, or space heaters that are considered insignificant activities under Minn. R. 7007.1300, subp. 2 and 3.",null,null,null,null,null,null,null,null,null,null,null,"Each month fill in the table below. Complete one table for each fuel type. \nAdd the most recent eligibility value across all boiler fuel types and enter in the 'Eligibility' tab.",null,null,null,null,null,null,"Each month fill in the table below. Complete one table for each fuel type. \nAdd the most recent eligibility value across all boiler fuel types and enter in the 'Eligibility' tab.",null,null,null,null,null,null,"Each month fill in the table below. Complete one table for each fuel type. \nAdd the most recent eligibility value across all boiler fuel types and enter in the 'Eligibility' tab."]
[]
[]
[null,null,null,null,null,null,null,null,null,null,null,null,null,"Fuel type","Choose one",null,{"$f":"IF(OR(O6='Data validation'!$B$7,OR(O6='Data validation'!$B$11,OR(O6='Data validation'!$B$10,OR(O6='Data validation'!$B$9,O6='Data validation'!$B$8)))),\" \",\"Record emission unit information for boilers using this fuel.\")","v":" "},null,null,null,"Fuel type","Choose one",null,{"$f":"IF(OR(V6='Data validation'!$B$7,OR(V6='Data validation'!$B$11,OR(V6='Data validation'!$B$10,OR(V6='Data validation'!$B$9,V6='Data validation'!$B$8)))),\" \",\"Record emission unit information for boilers using this fuel.\")","v":" "},null,null,null,"Fuel type","Choose one",null,{"$f":"IF(OR(AC6='Data validation'!$B$7,OR(AC6='Data validation'!$B$11,OR(AC6='Data validation'!$B$10,OR(AC6='Data validation'!$B$9,AC6='Data validation'!$B$8)))),\" \",\"Record emission unit information for boilers using this fuel.\")","v":" "}]
{"$rows_left_out":67}
{"sheet":"Engines (fuel use)","index":2,"n_rows":72,"n_cols":33,"rows_kept":72,"cut":false,"hidden":false,"merged":[[7,29,7,32],[16,4,16,11],[17,4,17,11],[18,3,18,11],[20,2,20,11],[9,31,10,31],[11,3,11,11],[13,2,13,11],[15,4,15,11],[9,24,10,24],[9,25,10,25],[9,27,10,27],[9,28,10,28],[9,29,10,29],[9,30,10,30],[9,17,10,17],[9,21,10,21],[10,4,10,11],[7,15,7,18],[7,22,7,25],[22,3,23,11],[21,3,21,11],[9,18,10,18],[9,20,10,20],[9,13,10,13],[9,14,10,14],[9,15,10,15],[9,16,10,16],[5,28,5,29],[5,30,5,32],[9,4,9,11],[6,16,6,18],[6,23,6,25],[6,30,6,32],[5,23,5,25],[7,3,7,11],[8,4,8,11],[5,14,5,15],[5,16,5,18],[5,21,5,22],[6,2,6,11],[9,22,10,22],[9,23,10,23],[9,32,10,32],[1,1,1,11],[1,13,1,18],[1,20,1,25],[1,27,1,32],[2,13,3,18],[2,20,3,25],[2,27,3,32],[2,1,2,11],[3,2,4,11]]}
[null,null,null,null,null,null,null,null,null,null,null,{"$f":"Instructions!O4","v":"p-sbap5-33  •  6/6/23"}]
[null,"Engines: by fuel use",null,null,null,null,null,null,null,null,null,null,null,"Engine fuel 1: monthly and 12-month rolling totals",null,null,null,null,null,null,"Engine fuel 2: monthly and 12-month rolling totals",null,null,null,null,null,null,"Engine fuel 3: monthly and 12-month rolling totals"]
[null,"Use this tab to track emissions for engines by the type and amount of fuel purchased or used. ",null,null,null,null,null,null,null,null,null,null,null,"Each month fill in the table below. Complete one table for each fuel type. \nAdd the most recent eligibility value across all engine fuel types and enter in the 'Eligibility' tab.",null,null,null,null,null,null,"Each month fill in the table below. Complete one table for each fuel type. \nAdd the most recent eligibility value across all engine fuel types and enter in the 'Eligibility' tab.",null,null,null,null,null,null,"Each month fill in the table below. Complete one table for each fuel type. \nAdd the most recent eligibility value across all engine fuel types and enter in the 'Eligibility' tab."]
[null,null,"If you enter the amount of fuel purchased or used for an engine this tab, do not enter the hours of operation for the same engine in the 'Engines (hours)' tab. Entering information in both tabs will double count your emissions."]
[]
[null,null,null,null,null,null,null,null,null,null,null,null,null,"Fuel type","Choose one",null,null,null,null,null,"Fuel type","Choose one",null,null,null,null,null,"Fuel type","Choose one"]
{"$rows_left_out":67}
{"sheet":"Engines (hours)","index":3,"n_rows":72,"n_cols":33,"rows_kept":72,"cut":false,"hidden":false,"merged":[[15,3,15,11],[17,2,17,11],[18,3,18,11],[19,3,20,11],[9,31,10,31],[9,23,10,23],[9,13,10,13],[9,14,10,14],[9,15,10,15],[9,16,10,16],[9,32,10,32],[10,2,10,11],[12,4,12,11],[13,4,13,11],[14,4,14,11],[9,24,10,24],[9,25,10,25],[9,27,10,27],[9,28,10,28],[9,29,10,29],[9,30,10,30],[9,17,10,17],[9,18,10,18],[9,20,10,20],[9,21,10,21],[9,22,10,22],[6,21,6,23],[6,28,6,30],[7,3,7,11],[8,4,8,11],[6,14,6,16],[6,2,6,11],[1,1,1,11],[1,13,1,18],[1,20,1,25],[1,27,1,32],[2,13,3,18],[2,20,3,25],[2,27,3,32],[2,1,2,11],[3,2,4,11]]}
[null,null,null,null,null,null,null,null,null,null,null,{"$f":"Instructions!O4","v":"p-sbap5-33  •  6/6/23"}]
[null,"Engines: by operating hours and horsepower",null,null,null,null,null,null,null,null,null,null,null,"Engine 1: monthly and 12-month rolling totals",null,null,null,null,null,null,"Engine 2: monthly and 12-month rolling totals",null,null,null,null,null,null,"Engine 3: monthly and 12-month rolling totals"]
[null,"Use this tab to track emissions for engines by number of hours individual engines are operated.",null,null,null,null,null,null,null,null,null,null,null,"Each month fill in the table below. Complete one table for each engine (by operation hours). \nAdd the most recent eligibility value across all engines (by operation hours) and enter in the 'Eligibility' tab.",null,null,null,null,null,null,"Each month fill in the table below. Complete one table for each engine (by operation hours). \nAdd the most recent eligibility value across all engines (by operation hours) and enter in the 'Eligibility' tab.",null,null,null,null,null,null,"Each month fill in the table below. Complete one table for each engine (by operation hours). \nAdd the most recent eligibility value across all engines (by operation hours) and enter in the 'Eligibility' tab."]
[null,null,"If you enter the operation hours for an engine on this tab, do not enter the amount of fuel purchased or used for the same engine in the 'Engines (fuel use)' tab. Entering information in both tabs will double count your emissions."]
[]
[null,null,null,null,null,null,null,null,null,null,null,null,null,"Emission unit ID",null,null,null,null,null,null,"Emission unit ID",null,null,null,null,null,null,"Emission unit ID"]
{"$rows_left_out":67}
{"sheet":"VOC-containing","index":4,"n_rows":71,"n_cols":38,"rows_kept":71,"cut":false,"hidden":false,"merged":[[8,20,9,20],[8,24,9,24],[7,4,7,11],[6,17,6,18],[6,19,6,20],[6,21,6,22],[6,23,6,24],[6,33,6,34],[8,25,9,25],[8,26,9,26],[8,27,9,27],[8,28,9,28],[8,29,9,29],[6,25,6,26],[6,27,6,28],[6,29,6,30],[6,31,6,32],[8,31,9,31],[8,32,9,32],[8,33,9,33],[8,34,9,34],[4,25,4,26],[4,27,4,28],[4,29,4,30],[4,31,4,32],[4,33,4,34],[5,25,5,26],[5,27,5,28],[5,29,5,30],[5,31,5,32],[5,33,5,34],[2,25,2,26],[2,27,2,28],[2,29,2,30],[2,31,2,32],[2,33,2,34],[3,25,3,26],[3,27,3,28],[3,29,3,30],[3,31,3,32],[3,33,3,34],[2,21,2,22],[3,21,3,22],[4,21,4,22],[5,21,5,22],[2,23,2,24],[3,23,3,24],[4,23,4,24],[5,23,5,24],[2,17,2,18],[3,17,3,18],[4,17,4,18],[5,17,5,18],[2,19,2,20],[3,19,3,20],[4,19,4,20],[5,19,5,20],[2,15,2,16],[3,15,3,16],[8,16,9,16],[4,15,4,16],[5,15,5,16],[6,15,6,16],[15,4,15,11],[21,2,21,11],[22,3,22,11],[23,3,24,11],[16,4,17,11],[18,3,19,11],[12,2,12,11],[14,4,14,11],[8,17,9,17],[8,18,9,18],[8,19,9,19],[8,5,8,11],[8,13,9,13],[8,14,9,14],[8,15,9,15],[9,5,10,11],[8,37,9,37],[8,21,9,21],[8,22,9,22],[8,23,9,23],[8,30,9,30],[8,36,9,36],[8,35,9,35],[4,3,4,11],[6,4,6,11],[5,4,5,11],[1,1,1,11],[3,2,3,11]]}
[null,null,null,null,null,null,null,null,null,null,null,{"$f":"Instructions!O4","v":"p-sbap5-33  •  6/6/23"}]
[null,"VOC-containing material use"]
[null,null,null,null,null,null,null,null,null,null,null,null,null,null,"Material name"]
[null,"1)","Enter the VOC-containing materials.",null,null,null,null,null,null,null,null,null,null,null,"SDS/product number"]
[null,null,"-","Each material can be identified along the top of the table to the right.",null,null,null,null,null,null,null,null,null,null,"% VOC (by weight)"]
[null,null,null,"•","Material name - product name or name used by the business",null,null,null,null,null,null,null,null,null,"Density (lb/gallon)"]
{"$rows_left_out":66}
{"sheet":"Eligibility","index":5,"n_rows":68,"n_cols":21,"rows_kept":68,"cut":false,"hidden":false,"merged":[[2,13,2,20],[2,1,2,11],[4,18,6,18],[4,19,6,19],[4,20,6,20],[5,3,6,11],[1,13,1,20],[30,4,31,11],[4,13,6,13],[4,14,6,14],[4,15,6,16],[4,17,6,17],[24,3,24,11],[25,4,26,11],[27,4,27,11],[28,3,28,11],[29,4,29,11],[19,3,19,11],[20,4,20,11],[1,1,1,11],[21,4,23,11],[4,2,4,11],[7,4,8,11],[11,3,11,11],[10,2,10,11],[12,3,13,11],[18,2,18,11],[14,4,15,11],[16,3,16,11]]}
[null,null,null,null,null,null,null,null,null,null,null,{"$f":"Instructions!O4","v":"p-sbap5-33  •  6/6/23"}]
[null,"Eligibility tracking",null,null,null,null,null,null,null,null,null,null,null,"Eligibility number summary"]
[null,"Complete the following steps monthly unless the facility qualifies for reduced recordkeeping.",null,null,null,null,null,null,null,null,null,null,null,"Content is based on the information entered into this calculator and is not an official MPCA permit determination."]
[]
[null,"1)","Complete the blue tabs before entering information here.",null,null,null,null,null,null,null,null,null,null,"Month and year","Boiler \neligibility value","Engine eligibility value\ndo not enter fuel and hours for the same engine(s)",null,"VOC \neligibility value","Eligibility number","Option C\nlimit","Option C reduced record-keeping"]
[null,null,"-","Each month, enter the amount, purchased or used, of boiler fuel (indirect heating units), engine fuel or engine operation hours (reciprocating internal combustion engines), and VOC-containing material in the blue tabs."]
{"$rows_left_out":63}
{"sheet":"Sulfur tracking","index":6,"n_rows":83,"n_cols":12,"rows_kept":83,"cut":false,"hidden":false,"merged":[[79,10,79,11],[80,10,80,11],[81,10,81,11],[82,10,82,11],[1,1,1,11],[74,10,74,11],[75,10,75,11],[76,10,76,11],[77,10,77,11],[78,10,78,11],[69,10,69,11],[70,10,70,11],[71,10,71,11],[72,10,72,11],[73,10,73,11],[64,10,64,11],[65,10,65,11],[66,10,66,11],[67,10,67,11],[68,10,68,11],[59,10,59,11],[60,10,60,11],[61,10,61,11],[62,10,62,11],[63,10,63,11],[54,10,54,11],[55,10,55,11],[56,10,56,11],[57,10,57,11],[58,10,58,11],[49,10,49,11],[50,10,50,11],[51,10,51,11],[52,10,52,11],[53,10,53,11],[44,10,44,11],[45,10,45,11],[46,10,46,11],[47,10,47,11],[48,10,48,11],[39,10,39,11],[40,10,40,11],[41,10,41,11],[42,10,42,11],[43,10,43,11],[34,10,34,11],[35,10,35,11],[36,10,36,11],[37,10,37,11],[38,10,38,11],[29,10,29,11],[30,10,30,11],[31,10,31,11],[32,10,32,11],[33,10,33,11],[24,10,24,11],[25,10,25,11],[26,10,26,11],[27,10,27,11],[28,10,28,11],[19,10,19,11],[20,10,20,11],[21,10,21,11],[22,10,22,11],[23,10,23,11],[78,5,78,7],[79,5,79,7],[80,5,80,7],[81,5,81,7],[82,5,82,7],[73,5,73,7],[74,5,74,7],[75,5,75,7],[76,5,76,7],[77,5,77,7],[68,5,68,7],[69,5,69,7],[70,5,70,7],[71,5,71,7],[72,5,72,7],[63,5,63,7],[64,5,64,7],[65,5,65,7],[66,5,66,7],[67,5,67,7],[58,5,58,7],[59,5,59,7],[60,5,60,7],[61,5,61,7],[62,5,62,7],[53,5,53,7],[54,5,54,7],[55,5,55,7],[56,5,56,7],[57,5,57,7],[48,5,48,7],[49,5,49,7],[50,5,50,7],[51,5,51,7],[52,5,52,7],[43,5,43,7],[44,5,44,7],[45,5,45,7],[46,5,46,7],[47,5,47,7],[39,5,39,7],[40,5,40,7],[41,5,41,7],[42,5,42,7],[33,5,33,7],[34,5,34,7],[35,5,35,7],[36,5,36,7],[37,5,37,7],[38,5,38,7],[3,10,3,11],[3,8,3,9],[4,2,5,6],[3,1,3,6],[8,2,9,6],[6,2,7,6],[10,2,13,6],[18,10,18,11],[15,10,17,11],[8,10,8,11],[4,10,4,11],[18,1,18,4],[15,9,16,9],[12,8,12,9],[11,8,11,9],[10,8,10,9],[9,8,9,9],[8,8,8,9],[6,8,6,9],[7,8,7,9],[5,8,5,9],[4,8,4,9],[15,8,16,8],[9,10,12,11],[53,1,53,4],[42,1,42,4],[43,1,43,4],[44,1,44,4],[33,1,33,4],[34,1,34,4],[35,1,35,4],[36,1,36,4],[37,1,37,4],[39,1,39,4],[40,1,40,4],[41,1,41,4],[15,5,17,7],[19,5,19,7],[20,5,20,7],[21,5,21,7],[22,5,22,7],[23,5,23,7],[21,1,21,4],[22,1,22,4],[23,1,23,4],[15,1,17,4],[24,1,24,4],[25,1,25,4],[26,1,26,4],[30,1,30,4],[26,5,26,7],[27,5,27,7],[19,1,19,4],[20,1,20,4],[18,5,18,7],[68,1,68,4],[69,1,69,4],[70,1,70,4],[71,1,71,4],[72,1,72,4],[73,1,73,4],[67,1,67,4],[56,1,56,4],[57,1,57,4],[58,1,58,4],[59,1,59,4],[60,1,60,4],[61,1,61,4],[62,1,62,4],[63,1,63,4],[64,1,64,4],[65,1,65,4],[66,1,66,4],[80,1,80,4],[81,1,81,4],[82,1,82,4],[74,1,74,4],[75,1,75,4],[76,1,76,4],[77,1,77,4],[78,1,78,4],[79,1,79,4],[5,10,7,11],[55,1,55,4],[54,1,54,4],[38,1,38,4],[51,1,51,4],[52,1,52,4],[45,1,45,4],[46,1,46,4],[47,1,47,4],[48,1,48,4],[49,1,49,4],[50,1,50,4],[28,5,28,7],[29,5,29,7],[30,5,30,7],[31,5,31,7],[32,5,32,7],[27,1,27,4],[28,1,28,4],[29,1,29,4],[24,5,24,7],[25,5,25,7],[31,1,31,4],[32,1,32,4]]}
[null,null,null,null,null,null,null,null,null,null,null,{"$f":"Instructions!O4","v":"p-sbap5-33  •  6/6/23"}]
[null,"Sulfur tracking: by fuel delivery"]
[]
[null,"For each fuel listed on the right, ",null,null,null,null,null,null,"Fuel Type",null,"Specification method"]
[null,"•","enter the date of fuel delivery and choose the type of fuel from the drop-down box.",null,null,null,null,null,"Kerosene",null,"ASTM D 3699 (Vol 05.03)"]
[null,null,null,null,null,null,null,null,"No. 1 and No. 2 distillate",null,"ASTM D 396 (Vol 05.01)"]
{"$rows_left_out":78}
{"sheet":"Boilers unit info","index":7,"n_rows":15,"n_cols":14,"rows_kept":15,"cut":false,"hidden":false,"merged":[[6,12,6,13],[12,10,14,10],[8,2,8,8],[7,2,7,8],[12,6,13,6],[12,7,13,7],[12,8,13,8],[12,9,13,9],[9,3,9,8],[10,3,10,8],[28,1,28,3],[29,1,29,3],[25,1,25,3],[1,1,1,13],[4,1,4,8],[5,2,6,8],[2,1,2,13],[12,11,14,11],[12,12,13,12],[12,13,13,13],[12,5,14,5],[5,10,5,11],[6,10,6,11],[7,10,7,11],[8,10,8,11],[5,12,5,13],[22,1,22,3],[23,1,23,3],[24,1,24,3],[26,1,26,3],[27,1,27,3],[30,1,30,3],[31,1,31,3],[33,1,33,3],[34,1,34,3],[7,12,7,13],[8,12,8,13],[12,4,14,4],[32,1,32,3],[12,1,14,3],[15,1,15,3],[16,1,16,3],[17,1,17,3],[18,1,18,3],[19,1,19,3],[20,1,20,3],[21,1,21,3]]}
[null,null,null,null,null,null,null,null,null,null,null,null,null,{"$f":"Instructions!O4","v":"p-sbap5-33  •  6/6/23"}]
[null,"Boilers: emission points"]
[null,"Record the following information (unless the facility qualifies for reduced recordkeeping)."]
[]
[null,"For every emission point from boiler(s) using the fuels on the right, keep a record of:",null,null,null,null,null,null,null,null,"Required for boilers using:"]
[null,"● ","the location of all emission points. For example, a facility layout labelled with each unit and stack, GPS coordinates, etc.",null,null,null,null,null,null,null,"No. 4 distillate",null,"Lignite A coal"]
{"$rows_left_out":10}
{"sheet":"Data validation","index":8,"n_rows":43,"n_cols":8,"rows_kept":43,"cut":false,"hidden":true,"merged":[[4,7,5,7],[11,6,18,6],[7,7,10,7],[4,6,5,6],[22,5,23,5],[7,6,10,6],[4,1,5,1],[4,2,5,2],[4,3,5,3],[4,4,5,4],[15,5,18,5],[10,5,12,5],[4,5,5,5],[22,1,23,1],[22,2,23,2],[22,3,23,3],[22,4,23,4],[31,1,32,1],[31,2,32,2]]}
[null,null,null,null,null,null,null,{"$f":"Instructions!O4","v":"p-sbap5-33  •  6/6/23"}]
[null,"Data validation"]
[]
[null,"Boilers"]
[null,"Fuel Type","Units","Multiplication factor","Sulfur limit","Specification method\n(American Society for Testing & Materials)","Additional recordkeeping","Max. throughput units"]
[]
{"$rows_left_out":37}