{"text_format":"1","workbook":"xlsx","n_sheets":16,"sheets":["Instructions","Business information","Federal standards","FAQs","Engine 1","Engine 2","Engine 3","Engine 4","Engine 5","Potential emissions","Actual emissions","Permits & requirements","Engine emission factors","Propane reference","Data validation","Data collection"],"not_rendered":{"charts":0,"images":2,"macros":1,"external_links":0,"defined_names":37,"comments":1,"pivot_tables":0},"unopened":[],"bounds":{"document_bytes":16777216,"sheet_cells":100000,"rows_first":2000,"rows_last":500,"rows_between":2000,"halvings":0,"cell_chars":16384,"cell_head_chars":4096},"cells_cut":0,"cells_raw":0,"read":"whole","date_system":"1900"}

{"sheet":"Instructions","index":0,"n_rows":31,"n_cols":15,"rows_kept":31,"cut":false,"hidden":false,"merged":[[4,1,4,14],[13,1,13,14],[0,1,3,5],[6,1,6,14],[9,1,9,14],[10,1,10,14],[8,1,8,14],[0,6,1,14],[5,1,5,14],[30,1,30,4],[19,2,19,14],[22,1,22,14],[14,2,14,14],[15,2,15,14],[16,2,16,14],[17,2,17,14],[23,1,23,14],[24,1,24,14],[25,2,25,3],[25,5,25,8],[25,10,25,14],[26,2,26,3],[26,4,26,14],[28,4,28,13],[18,2,18,14]]}
[null,null,null,null,null,null,"Internal combustion engines \nair emissions calculator"]
[]
[null,null,null,null,null,null,null,null,null,null,null,null,null,null,"p-sbap5-25  •  12/13/23"]
[]
[null,"Instructions"]
[null,"1) Start by filling out the 'Business information' tab."]
[null,"2) See the 'Federal standards' tab to identify if a federal rule applies to your engine."]
[null,"3) The 'FAQs' tab contains definitions to help you identify specifics about your engine."]
[null,"4) Use the blue tabs across the bottom to enter information for your engines. Use only one blue tab per engine."]
[null,"5) The green tabs total potential and actual emissions from the information entered on the blue tabs."]
{"$rows_left_out":22}
{"sheet":"Business information","index":1,"n_rows":44,"n_cols":4,"rows_kept":44,"cut":false,"hidden":false,"merged":[[28,2,28,3],[0,1,0,4],[2,1,2,4],[25,2,27,3]]}
[null,{"$f":"Instructions!O3","v":"p-sbap5-25  •  12/13/23"}]
[]
[null,"Business information"]
[null,"If you have more than one physical location, complete a separate file."]
[]
[null,"Facility information"]
[null,"Provide details about the business where the engines are located. "]
[null,null,null,"Example"]
[null,"Business/facility name:",null,"Bobby's Business"]
[null,"Physical address:",null,"456 Sticks Road"]
{"$rows_left_out":35}
{"sheet":"Federal standards","index":2,"n_rows":52,"n_cols":14,"rows_kept":52,"cut":false,"hidden":false,"merged":[[49,3,51,8],[17,1,20,2],[44,1,46,2],[39,9,40,14],[49,9,50,14],[51,9,51,14],[49,1,51,2],[38,1,38,16],[39,1,40,2],[39,3,40,8],[41,1,43,2],[44,3,45,8],[44,9,45,14],[34,12,34,13],[34,8,34,9],[46,3,48,8],[0,1,0,16],[6,1,7,16],[21,1,22,2],[9,3,10,8],[11,3,12,8],[13,3,14,8],[15,3,16,8],[9,9,10,16],[11,9,12,16],[13,9,14,12],[13,13,14,16],[15,9,16,12],[17,9,20,12],[15,1,16,2],[17,13,20,16],[2,1,3,16],[34,1,34,7],[34,10,34,11],[21,3,22,8],[21,9,22,16],[46,9,48,14],[27,1,27,14],[28,1,29,14],[30,2,30,14],[31,1,32,1],[33,2,33,15],[31,2,32,15],[41,9,43,14],[41,3,43,8],[37,1,37,14],[36,1,36,12],[1,1,1,16],[9,1,10,2],[11,1,12,2],[17,3,20,8],[15,13,16,16],[13,1,14,2]]}
[null,{"$f":"Instructions!O3","v":"p-sbap5-25  •  12/13/23"}]
[null,"U.S. Environmental Protection Agency (EPA) standards for reciprocating internal combustion engines (RICE)"]
[null,"Applicability is determined separately for each engine. Each engine and any other air pollutant sources at your site will need to be evaluated for air emissions."]
[]
[]
[null,"Federal rules for engines"]
[null,"Federal standards can determine whether you need a permit and what requirements you must follow. You may have to follow federal standard requirements in addition to state permit requirements. Below are some of the common federal standards that affect engines."]
[]
[]
[null,"Federal standards",null,"National emission standards for hazardous air pollutants (NESHAP)",null,null,null,null,null,"New source performance standards (NSPS)"]
{"$rows_left_out":43}
{"sheet":"FAQs","index":3,"n_rows":39,"n_cols":15,"rows_kept":39,"cut":false,"hidden":false,"merged":[[13,2,13,14],[15,2,15,14],[16,3,16,14],[17,3,17,14],[4,1,4,14],[1,1,1,14],[22,1,22,14],[7,1,7,14],[35,7,35,14],[36,7,36,14],[30,6,30,14],[30,4,30,5],[27,2,27,4],[25,2,25,14],[11,3,11,14],[10,2,10,14],[12,3,12,14],[20,1,20,14],[19,1,19,14],[3,1,3,14],[6,1,6,14],[37,7,37,14],[38,7,38,14],[32,6,32,14],[32,4,32,5],[33,4,33,5],[34,7,34,14],[33,6,33,14]]}
[null,null,null,null,null,null,null,null,null,null,null,null,null,null,{"$f":"Instructions!O3","v":"p-sbap5-25  •  12/13/23"}]
[null,"Frequently asked questions"]
[]
[null,"What is a stationary internal combustion engine?"]
[null,"Stationary ICE include reciprocating ICE, rotary ICE, and other ICE, except combustion turbines."]
[]
[null,"Is my engine considered mobile or stationary?"]
[null,"Stationary internal combustion engine differs from a mobile internal combustion engine in that a stationary internal combustion engine is not a nonroad engine and is not used to propel a motor vehicle, aircraft, or a vehicle used solely for competition. "]
[]
[null,null,"What is a nonroad engine?"]
{"$rows_left_out":30}
{"sheet":"Engine 1","index":4,"n_rows":77,"n_cols":10,"rows_kept":77,"cut":false,"hidden":false,"merged":[[0,1,0,9],[46,6,46,8],[73,1,73,4],[21,1,21,3],[18,4,18,5],[18,6,18,7],[24,1,24,3],[4,2,4,3],[5,2,5,3],[6,2,6,3],[7,2,7,3],[1,1,1,9],[2,1,2,8],[74,1,74,4],[25,1,25,8],[26,1,26,8],[30,9,31,9],[28,9,29,9],[28,7,29,7],[28,8,29,8],[28,5,29,5],[28,6,29,6],[28,3,29,3],[28,4,29,4],[28,1,29,1],[28,2,29,2]]}
[null,{"$f":"Instructions!O3","v":"p-sbap5-25  •  12/13/23"}]
[null,"Air emissions from internal combustion engines"]
[null,"For each engine, complete one engine tab and include all information in the blue boxes. "]
[]
[null,"Engine designation","Engine 1",null,null,"Date of manufacture",null,"located on nameplate"]
[null,"Make",null,null,null,"Date installed",null,"at the site"]
[null,"Model",null,null,null,"Displacement",null,"liters/cylinder"]
[null,"Electrical output",null,null,"kW","Diesel engine tier","Choose one","if known"]
[]
[null,"Does this engine operate to do any of the following? Select yes or no for each. Go to the 'FAQs' tab for more information."]
{"$rows_left_out":68}
{"sheet":"Engine 2","index":5,"n_rows":77,"n_cols":10,"rows_kept":77,"cut":false,"hidden":false,"merged":[[74,1,74,4],[28,7,29,7],[28,8,29,8],[28,9,29,9],[30,9,31,9],[46,6,46,8],[73,1,73,4],[28,1,29,1],[28,2,29,2],[28,3,29,3],[28,4,29,4],[28,5,29,5],[28,6,29,6],[24,1,24,3],[25,1,25,8],[26,1,26,8],[21,1,21,3],[7,2,7,3],[18,4,18,5],[18,6,18,7],[6,2,6,3],[0,1,0,9],[1,1,1,9],[2,1,2,8],[4,2,4,3],[5,2,5,3]]}
[null,{"$f":"Instructions!O3","v":"p-sbap5-25  •  12/13/23"}]
[null,"Air emissions from internal combustion engines"]
[null,"For each engine, complete one engine tab and include all information in the blue boxes. "]
[]
[null,"Engine designation","Engine 2",null,null,"Date of manufacture",null,"located on nameplate"]
[null,"Make",null,null,null,"Date installed",null,"at the site"]
[null,"Model",null,null,null,"Displacement",null,"liters/cylinder"]
[null,"Electrical output",null,null,"kW","Diesel engine tier","Choose one","if known"]
[]
[null,"Does this engine operate to do any of the following? Select yes or no for each. Go to the 'FAQs' tab for more information."]
{"$rows_left_out":68}
{"sheet":"Engine 3","index":6,"n_rows":77,"n_cols":10,"rows_kept":77,"cut":false,"hidden":false,"merged":[[74,1,74,4],[28,7,29,7],[28,8,29,8],[28,9,29,9],[30,9,31,9],[46,6,46,8],[73,1,73,4],[28,1,29,1],[28,2,29,2],[28,3,29,3],[28,4,29,4],[28,5,29,5],[28,6,29,6],[24,1,24,3],[24,5,24,8],[25,1,25,8],[26,1,26,8],[21,1,21,3],[7,2,7,3],[18,4,18,5],[18,6,18,7],[0,1,0,9],[1,1,1,9],[2,1,2,8],[4,2,4,3],[5,2,5,3],[6,2,6,3]]}
[null,{"$f":"Instructions!O3","v":"p-sbap5-25  •  12/13/23"}]
[null,"Air emissions from internal combustion engines"]
[null,"For each engine, complete one engine tab and include all information in the blue boxes. "]
[]
[null,"Engine designation","Engine 3",null,null,"Date of manufacture",null,"located on nameplate"]
[null,"Make",null,null,null,"Date installed",null,"at the site"]
[null,"Model",null,null,null,"Displacement",null,"liters/cylinder"]
[null,"Electrical output",null,null,"kW","Diesel engine tier","Choose one","if known"]
[]
[null,"Does this engine operate to do any of the following? Select yes or no for each. Go to the 'FAQs' tab for more information."]
{"$rows_left_out":68}
{"sheet":"Engine 4","index":7,"n_rows":77,"n_cols":10,"rows_kept":77,"cut":false,"hidden":false,"merged":[[74,1,74,4],[28,7,29,7],[28,8,29,8],[28,9,29,9],[30,9,31,9],[46,6,46,8],[73,1,73,4],[28,1,29,1],[28,2,29,2],[28,3,29,3],[28,4,29,4],[28,5,29,5],[28,6,29,6],[24,1,24,3],[24,5,24,8],[25,1,25,8],[26,1,26,8],[21,1,21,3],[7,2,7,3],[18,4,18,5],[18,6,18,7],[0,1,0,9],[1,1,1,9],[2,1,2,8],[4,2,4,3],[5,2,5,3],[6,2,6,3]]}
[null,{"$f":"Instructions!O3","v":"p-sbap5-25  •  12/13/23"}]
[null,"Air emissions from internal combustion engines"]
[null,"For each engine, complete one engine tab and include all information in the blue boxes. "]
[]
[null,"Engine designation","Engine 4",null,null,"Date of manufacture",null,"located on nameplate"]
[null,"Make",null,null,null,"Date installed",null,"at the site"]
[null,"Model",null,null,null,"Displacement",null,"liters/cylinder"]
[null,"Electrical output",null,null,"kW","Diesel engine tier","Choose one","if known"]
[]
[null,"Does this engine operate to do any of the following? Select yes or no for each. Go to the 'FAQs' tab for more information."]
{"$rows_left_out":68}
{"sheet":"Engine 5","index":8,"n_rows":77,"n_cols":10,"rows_kept":77,"cut":false,"hidden":false,"merged":[[74,1,74,4],[28,7,29,7],[28,8,29,8],[28,9,29,9],[30,9,31,9],[46,6,46,8],[73,1,73,4],[28,1,29,1],[28,2,29,2],[28,3,29,3],[28,4,29,4],[28,5,29,5],[28,6,29,6],[24,1,24,3],[24,5,24,8],[25,1,25,8],[26,1,26,8],[21,1,21,3],[7,2,7,3],[18,4,18,5],[18,6,18,7],[0,1,0,9],[1,1,1,9],[2,1,2,8],[4,2,4,3],[5,2,5,3],[6,2,6,3]]}
[null,{"$f":"Instructions!O3","v":"p-sbap5-25  •  12/13/23"}]
[null,"Air emissions from internal combustion engines"]
[null,"For each engine, complete one engine tab and include all information in the blue boxes. "]
[]
[null,"Engine designation","Engine 5",null,null,"Date of manufacture",null,"located on nameplate"]
[null,"Make",null,null,null,"Date installed",null,"at the site"]
[null,"Model",null,null,null,"Displacement",null,"liters/cylinder"]
[null,"Electrical output",null,null,"kW","Diesel engine tier","Choose one","if known"]
[]
[null,"Does this engine operate to do any of the following? Select yes or no for each. Go to the 'FAQs' tab for more information."]
{"$rows_left_out":68}
{"sheet":"Potential emissions","index":9,"n_rows":47,"n_cols":10,"rows_kept":47,"cut":false,"hidden":false,"merged":[[1,1,1,8],[3,1,4,1],[2,1,2,8],[0,1,0,8]]}
[null,{"$f":"Instructions!O3","v":"p-sbap5-25  •  12/13/23"}]
[null,"Potential emissions: Engines"]
[null,{"$f":"IF('Data validation'!B28=\"yes\",\"The flag next to a potential emission total means your potential emissions exceed the permitting threshold and a permit is required.\",\"These pollutant totals represent the information you entered on the blue tabs.\")","v":"These pollutant totals represent the information you entered on the blue tabs."}]
[null,"Pollutant",{"$f":"'Engine 1'!$C$5","v":"Engine 1"},{"$f":"'Engine 2'!$C$5","v":"Engine 2"},{"$f":"'Engine 3'!$C$5","v":"Engine 3"},{"$f":"'Engine 4'!$C$5","v":"Engine 4"},{"$f":"'Engine 5'!$C$5","v":"Engine 5"},"Potential Emissions","Permitting Threshold"]
[null,null,"(ton/yr)","(ton/yr)","(ton/yr)","(ton/yr)","(ton/yr)","(ton/yr)","(ton/yr)"]
[null,"Criteria Air Pollutants"]
[null,"PM",{"$f":"'Engine 1'!$H34","v":0},{"$f":"'Engine 2'!$H34","v":0},{"$f":"'Engine 3'!$H34","v":0},{"$f":"'Engine 4'!$H34","v":0},{"$f":"'Engine 5'!$H34","v":0},{"$f":"SUM(C7:G7)","v":0},100,{"$f":"IF(H7>=I7,1,0)","v":0}]
[null,"PM10",{"$f":"'Engine 1'!$H35","v":0},{"$f":"'Engine 2'!$H35","v":0},{"$f":"'Engine 3'!$H35","v":0},{"$f":"'Engine 4'!$H35","v":0},{"$f":"'Engine 5'!$H35","v":0},{"$f":"SUM(C8:G8)","v":0},25,{"$f":"IF(H8>=I8,1,0)","v":0}]
[null,"PM2.5",{"$f":"'Engine 1'!$H36","v":0},{"$f":"'Engine 2'!$H36","v":0},{"$f":"'Engine 3'!$H36","v":0},{"$f":"'Engine 4'!$H36","v":0},{"$f":"'Engine 5'!$H36","v":0},0,100]
[null,"SOx",{"$f":"'Engine 1'!$H37","v":0},{"$f":"'Engine 2'!$H37","v":0},{"$f":"'Engine 3'!$H37","v":0},{"$f":"'Engine 4'!$H37","v":0},{"$f":"'Engine 5'!$H37","v":0},0,50,0]
{"$rows_left_out":38}
{"sheet":"Actual emissions","index":10,"n_rows":47,"n_cols":10,"rows_kept":47,"cut":false,"hidden":false,"merged":[[1,1,1,8],[3,1,4,1],[0,1,0,8],[2,1,2,8]]}
[null,{"$f":"Instructions!O3","v":"p-sbap5-25  •  12/13/23"}]
[null,"Actual emissions: Engines"]
[null,{"$f":"IF('Data validation'!B31=\"yes\",\"The flag next to your actual emissions total indicates that your business exceeds the Option D limit and an individual permit is required.\",\"These pollutant totals represent the information you entered on the blue tabs.\")","v":"These pollutant totals represent the information you entered on the blue tabs."}]
[null,"Pollutant",{"$f":"'Potential emissions'!C4","v":"Engine 1"},{"$f":"'Potential emissions'!D4","v":"Engine 2"},{"$f":"'Potential emissions'!E4","v":"Engine 3"},{"$f":"'Potential emissions'!F4","v":"Engine 4"},{"$f":"'Potential emissions'!G4","v":"Engine 5"},"Actual Emissions","Opt. D Permit Limits"]
[null,null,"(ton/yr)","(ton/yr)","(ton/yr)","(ton/yr)","(ton/yr)","(ton/yr)","(ton/yr)"]
[null,"Criteria Air Pollutants"]
[null,"PM",{"$f":"'Engine 1'!$I34","v":0},{"$f":"'Engine 2'!$I34","v":0},{"$f":"'Engine 3'!$I34","v":0},{"$f":"'Engine 4'!$I34","v":0},{"$f":"'Engine 5'!$I34","v":0},{"$f":"SUM(C7:G7)","v":0},50,{"$f":"IF(H7>=I7,1,0)","v":0}]
[null,"PM10",{"$f":"'Engine 1'!$I35","v":0},{"$f":"'Engine 2'!$I35","v":0},{"$f":"'Engine 3'!$I35","v":0},{"$f":"'Engine 4'!$I35","v":0},{"$f":"'Engine 5'!$I35","v":0},{"$f":"SUM(C8:G8)","v":0},50,{"$f":"IF(H8>=I8,1,0)","v":0}]
[null,"PM2.5",{"$f":"'Engine 1'!$I36","v":0},{"$f":"'Engine 2'!$I36","v":0},{"$f":"'Engine 3'!$I36","v":0},{"$f":"'Engine 4'!$I36","v":0},{"$f":"'Engine 5'!$I36","v":0},0]
[null,"SOx",{"$f":"'Engine 1'!$I37","v":0},{"$f":"'Engine 2'!$I37","v":0},{"$f":"'Engine 3'!$I37","v":0},{"$f":"'Engine 4'!$I37","v":0},{"$f":"'Engine 5'!$I37","v":0},0,50,0]
{"$rows_left_out":38}
{"sheet":"Permits & requirements","index":11,"n_rows":42,"n_cols":9,"rows_kept":42,"cut":false,"hidden":false,"merged":[[17,1,18,8],[14,1,15,1],[14,2,15,2],[10,5,11,6],[12,5,13,6],[14,5,15,6],[5,1,6,8],[10,1,11,1],[10,2,11,2],[12,8,13,8],[12,7,13,7],[12,1,13,1],[12,2,13,2],[10,7,11,7],[10,8,11,8],[36,2,37,8],[38,1,40,8],[41,1,41,8],[0,1,0,8],[2,1,4,8],[8,1,8,4],[29,2,29,3],[33,1,33,2],[33,3,33,4],[1,1,1,8],[9,5,9,6],[10,4,15,4],[14,7,15,7],[14,8,15,8],[8,5,8,8],[10,3,14,3]]}
[null,{"$f":"Instructions!O3","v":"p-sbap5-25  •  12/13/23"}]
[null,"Permits and requirements"]
[null,"The need for a permit is based on your entire business's potential air emissions. All activities that put pollutants into the air (including paint and solvent use, woodworking, metalworking) need to be assessed in addition to the engines included in this calculator. Once you determine if you need a permit, based on whether an NSPS applies and your total potential emissions, you can then use your actual emissions to see which permit is the best fit for your business."]
[]
[]
[null,"If you have additional air emission sources, you must assess your facility's total potential emissions from all sources to identify your permitting needs."]
[]
[]
[null,"Is a permit required?",null,null,null,"What type of permit?"]
[null,"Does your business's potential emissions exceed permit thresholds?","Does your business's actual emissions exceed Option D limits","Is there an engine subject to a federal NSPS?","Is there an engine subject to the federal NESHAP?","Which permit do you need?",null,"More Information ","Forms"]
{"$rows_left_out":33}
{"sheet":"Engine emission factors","index":12,"n_rows":59,"n_cols":9,"rows_kept":59,"cut":false,"hidden":false,"merged":[[1,0,1,7],[58,1,58,4],[0,0,0,8]]}
[{"$f":"Instructions!O3","v":"p-sbap5-25  •  12/13/23"}]
["Engine emission factors"]
[null,"RECIPROCATING ENGINES (<600HP) DIESEL (lb/MMBtu)1","RECIPROCATING ENGINES (>=600HP) DIESEL (lb/MMBtu)1","TURBINE ENGINES (electrical generation) NATURAL GAS (lb/MMBtu)1","RECIPROCATING GASOLINE (lb/MMBtu)2","RECIPROCATING Natural Gas 4-Stroke  Rich-Burn (lb/MMBtu)","RECIPROCATING Natural Gas 4-Stroke Lean-Burn (lb/MMBtu)","RECIPROCATING Natural Gas 2-Stroke Lean-Burn (lb/MMBtu)","RECIPROCATING Propane3,4,5\n(lb/MMBtu)"]
["source","AP42 Chpt 3.3 (10/96)","AP42 Chpt 3.4 (10/96)","AP42 Chpt 3.1 (4/00)","AP42 Chpt 3.3 (10/96)","AP42 Chpt 3.2-3 (7/00)","AP42 Chpt 3.2-2 (7/00)","AP42 Chpt 3.2-2 (7/00)","EPA/AIRS by SCC3,4"]
["PM",0.31,0.1,6.6E-3,0.1,{"$f":"0.0095+0.00991","v":1.941E-2},{"$f":"0.0000771+0.00991","v":9.9871000000000005E-3},{"$f":"0.0384+0.00991","v":4.8309999999999999E-2},{"$f":"I6","v":5.434782608695652E-2}]
["PM10",0.31,{"$f":"0.0496+0.0077","v":5.7299999999999997E-2},{"$f":"0.0019+0.0047","v":6.6E-3},0.1,{"$f":"0.0095+0.00991","v":1.941E-2},{"$f":"G5","v":9.9871000000000005E-3},{"$f":"H5","v":4.8309999999999999E-2},{"$f":"5/(H55/(10^6)*1000)","v":5.434782608695652E-2}]
["PM2.5",0.31,{"$f":"0.0479+0.0077","v":5.5599999999999997E-2},{"$f":"D6","v":6.6E-3},0.1,{"$f":"F6","v":1.941E-2},{"$f":"G5","v":9.9871000000000005E-3},{"$f":"H6","v":4.8309999999999999E-2},{"$f":"I6","v":5.434782608695652E-2}]
["SOx",1.01,1.01,0.94,8.4000000000000005E-2,5.8799999999999998E-4,5.8799999999999998E-4,5.8799999999999998E-4,{"$f":"(0.1)/(H55/(10^6)*1000)","v":1.0869565217391304E-3}]
["NOx",4.41,3.2,0.32,1.63,2.21,4.08,3.17,{"$f":"139/(H55/(10^6)*1000)","v":1.5108695652173914}]
["VOC",{"$f":"0.35+0+0.01+0","v":0.36},0.09,2.0999999999999999E-3,{"$f":"2.1+0.09+0.69+0.15","v":3.03},2.9600000000000001E-2,0.11799999999999999,0.12,{"$f":"83/(H55/(10^6)*1000)","v":0.90217391304347827}]
{"$rows_left_out":50}
{"sheet":"Propane reference","index":13,"n_rows":2,"n_cols":1,"rows_kept":2,"cut":false,"hidden":false,"merged":[[1,0,1,15],[0,0,0,15]]}
[{"$f":"Instructions!O3","v":"p-sbap5-25  •  12/13/23"}]
["Propane emission factor reference"]

{"sheet":"Data validation","index":14,"n_rows":92,"n_cols":6,"rows_kept":92,"cut":false,"hidden":true,"merged":[[1,0,1,5],[0,0,0,3]]}
[{"$f":"Instructions!O3","v":"p-sbap5-25  •  12/13/23"}]
["Data Validation"]
[]
["Engines",null,null,"MN Counties",null,"Utility Companies"]
["Engine and Fuel Type","Choose one to calculate actual emissions",null,"Choose one",null,"Choose one"]
["Choose one","Number of hours operated per 12 months",null,"Aitkin",null,"Agralite Electric Coop"]
["Reciprocating - diesel","Quantity of fuel actually burned per 12 months",null,"Anoka",null,"Beltrami Electric Coop"]
["Reciprocating - gasoline",null,null,"Becker",null,"Benco Electric"]
["Reciprocating - propane",null,null,"Beltrami",null,"Brown County Rural Electric"]
["Turbine - natural gas","Actual emissions entry",null,"Benton",null,"Clearwater Polk electric"]
{"$rows_left_out":83}
{"sheet":"Data collection","index":15,"n_rows":167,"n_cols":2,"rows_kept":167,"cut":false,"hidden":true,"merged":[]}
["Business/facility name:",{"$f":"'Business information'!C9","v":0}]
["Physical address:",{"$f":"'Business information'!C10","v":0}]
["Physical address 2:",{"$f":"'Business information'!C11","v":0}]
["City:",{"$f":"'Business information'!C12","v":0}]
["County:",{"$f":"'Business information'!C13","v":"Choose one"}]
["State:",{"$f":"'Business information'!C14","v":"MN"}]
["Zip code:",{"$f":"'Business information'!C15","v":0}]
["Mailing address:",{"$f":"'Business information'!C18","v":0}]
["Mailing address 2:",{"$f":"'Business information'!C19","v":0}]
["City:",{"$f":"'Business information'!C20","v":0}]
{"$rows_left_out":157}