{"text_format":"1","workbook":"xlsx","n_sheets":14,"sheets":["Instructions","Federal standards","MPCA insignificant activities","Natural gas","Propane","Fuel oil","Waste oil","Wood","Potential emissions","Actual emissions","Permits & requirements","Fuel oil emission factors","Wood emission factors","Data validation"],"not_rendered":{"charts":0,"images":1,"macros":1,"external_links":1,"defined_names":37,"comments":0,"pivot_tables":0},"unopened":[],"bounds":{"document_bytes":16777216,"sheet_cells":100000,"rows_first":2000,"rows_last":500,"rows_between":2000,"halvings":0,"cell_chars":16384,"cell_head_chars":4096},"cells_cut":0,"cells_raw":0,"read":"whole","date_system":"1900"}

{"sheet":"Instructions","index":0,"n_rows":29,"n_cols":6,"rows_kept":29,"cut":false,"hidden":false,"merged":[[29,10,29,14],[0,5,0,14],[1,5,1,14],[3,1,3,14],[4,1,4,14],[11,1,11,14],[12,2,12,14],[13,2,13,14],[14,2,14,14],[15,2,15,14],[16,2,16,14],[5,1,5,14],[8,1,8,14],[2,5,2,14],[6,1,7,14],[28,5,28,10],[26,4,26,13],[17,2,17,14],[20,1,20,14],[24,2,24,3],[22,1,22,14],[23,2,23,3],[23,5,23,8],[24,4,24,14],[21,1,21,14],[23,10,23,14]]}
[null,null,null,null,null,"Boilers, furnaces, and space heaters\nAir emissions calculator"]
[]
[null,null,null,null,null,"p-sbap5-21  •  6/5/23"]
[null,"Instructions"]
[null,"1) Start with the blue 'Federal standards' tab, then use the other blue tabs to enter information about your boilers."]
[null,"2) The green tabs add up potential and actual emissions from the information entered on the blue tabs."]
[null,"3) The yellow 'Permits & requirements' tab will help you decide which permit to apply for if the only emissions at your business is from boilers entered into\n    this calculator."]
[]
{"$rows_left_out":22}
{"sheet":"Federal standards","index":1,"n_rows":47,"n_cols":14,"rows_kept":47,"cut":false,"hidden":false,"merged":[[13,1,13,14],[36,1,36,14],[37,1,37,14],[25,1,25,14],[5,1,5,14],[12,1,12,14],[15,1,15,12],[15,13,15,14],[14,1,14,14],[20,13,21,14],[20,2,21,7],[18,10,18,12],[18,8,18,9],[47,1,47,14],[16,1,16,12],[22,1,22,14],[24,1,24,14],[23,6,23,14],[46,13,46,14],[39,1,40,14],[42,2,43,14],[41,2,41,14],[44,2,44,14],[46,8,46,9],[27,1,27,12],[27,13,27,14],[17,1,17,12],[16,13,19,14],[18,2,19,7],[1,1,1,14],[7,2,8,13],[9,2,11,13],[9,1,11,1],[7,1,8,1],[6,14,11,14],[6,2,6,13],[2,1,4,7],[2,8,4,14],[0,1,0,14],[46,10,46,12],[45,1,45,14],[46,1,46,7],[38,1,38,14],[28,13,32,14],[33,1,33,12],[35,2,35,12],[30,10,30,12],[34,2,34,12],[33,13,35,14],[32,2,32,8],[30,2,31,7],[23,1,23,2],[23,3,23,5],[26,1,26,14]]}
[null,{"$f":"Instructions!F3","v":"p-sbap5-21  •  6/5/23"}]
[null,"U.S. Environmental Protection Agency (EPA) standards"]
[null,"New source performance standards (NSPS) require new emission sources to be less polluting than older sources.",null,null,null,null,null,null,"National emission standards for hazardous air pollutants (NESHAP) prevent or reduce emissions that have health impacts."]
[]
[]
[]
[null,"▪ ","Each NSPS or NESHAP applies to specific equipment, processes, or industries. "]
[null,"▪ ","Multiple federal standards may apply to your business. It is possible that if you make a change at your business, a federal standard that did not previously apply now will, or the one you are already following may have additional requirements."]
{"$rows_left_out":40}
{"sheet":"MPCA insignificant activities","index":2,"n_rows":126,"n_cols":17,"rows_kept":126,"cut":false,"hidden":false,"merged":[[101,1,101,14],[1,16,4,20],[3,1,3,14],[0,1,0,14],[28,1,28,14],[22,1,22,14],[34,1,34,14],[47,1,47,14],[58,1,58,14],[75,1,80,1],[84,1,91,1],[29,2,29,12],[44,2,44,12],[46,1,46,14],[35,2,35,12],[97,2,99,12],[67,1,67,14],[69,1,69,14],[72,1,72,14],[92,1,92,14],[96,1,96,14],[81,2,82,12],[81,1,82,1],[90,4,90,12],[41,2,41,12],[39,13,39,14],[39,1,39,12],[40,1,40,14],[49,1,49,14],[76,3,77,3],[87,4,87,12],[88,4,88,12],[78,4,78,12],[45,2,45,12],[19,1,19,14],[60,13,61,14],[26,1,26,14],[66,13,66,14],[27,1,27,12],[27,13,27,14],[65,1,65,14],[123,2,123,4],[109,2,109,14],[115,2,116,14],[119,3,120,14],[105,1,105,14],[110,1,111,14],[117,2,118,14],[113,2,114,14],[122,2,122,4],[43,1,43,14],[33,1,33,12],[74,2,75,3],[74,4,75,12],[83,2,84,3],[83,4,84,12],[89,2,89,12],[42,2,42,12],[124,2,124,4],[8,1,8,14],[37,1,37,12],[15,1,15,14],[62,1,62,14],[50,1,50,14],[32,1,32,14],[36,1,36,14],[38,1,38,14],[33,13,33,14],[52,13,52,14],[54,3,55,11],[57,3,57,11],[56,3,56,11],[53,3,53,11],[20,2,21,12],[23,2,23,12],[24,2,25,12],[48,1,48,14],[37,13,37,14],[59,2,61,12],[52,1,52,12],[30,2,31,12],[107,2,108,14],[1,1,1,14],[18,1,18,12],[16,1,16,12],[4,1,5,12],[7,1,7,12],[9,1,9,12],[4,13,4,14],[7,13,7,14],[9,13,9,14],[16,13,16,14],[18,13,18,14],[11,2,11,12],[12,2,12,12],[13,1,13,14],[6,1,6,14],[14,1,14,12],[14,13,14,14],[10,1,10,14],[2,1,2,14],[17,1,17,14],[125,2,125,4],[63,2,64,12],[63,13,64,14],[68,1,68,12],[68,13,68,14],[70,2,71,12],[66,1,66,12],[79,4,79,12],[80,4,80,12],[73,13,73,14],[85,4,86,12],[93,2,95,12],[73,1,73,12],[76,2,77,2],[76,4,77,12],[104,1,104,14],[90,2,90,3],[85,2,86,2],[85,3,86,3],[100,1,100,14],[91,4,91,12],[122,6,124,14],[112,1,112,14],[106,2,106,14]]}
[null,{"$f":"Instructions!F3","v":"p-sbap5-21  •  6/5/23"}]
[null,"MPCA insignificant activities",null,null,null,null,null,null,null,null,null,null,null,null,null,null,"Tip: This section will be quicker to complete if you make a list of your heating units, the fuel they use, and the rated heat input of each unit."]
[null,"Answer the questions below to see if your heating units qualify as insignificant activities and if they must be included in a permit application."]
[]
[null,"Is your boiler, furnace, or space heater used only for heating water for on-site personal use (such as bathroom sinks) \nor is it used only for food preparation at your restaurant or cafeteria?",null,null,null,null,null,null,null,null,null,null,null,"Choose Y/N"]
[]
[]
[null,"Do each of your process boilers, furnaces, and space heaters have a rated heat input of less than 19,000 Btu/hr?",null,null,null,null,null,null,null,null,null,null,null,"Choose Y/N"]
{"$rows_left_out":119}
{"sheet":"Natural gas","index":3,"n_rows":49,"n_cols":17,"rows_kept":49,"cut":false,"hidden":false,"merged":[[0,1,0,10],[8,1,8,5],[5,1,5,8],[7,4,7,5],[6,1,6,5],[7,1,7,3],[7,7,7,8],[8,6,8,8],[8,14,10,15],[8,16,10,17],[2,1,3,8],[2,16,3,17],[1,12,1,17],[4,1,4,8],[6,14,7,15],[4,14,5,15],[4,16,5,17],[6,16,7,17],[4,12,5,13],[1,1,1,10],[6,12,7,13],[2,12,3,13],[2,14,3,15],[9,1,9,8],[8,12,10,13],[48,6,48,7],[46,1,46,8],[47,1,47,8],[48,1,48,5],[11,10,12,10],[10,1,15,1],[11,2,15,2],[11,3,12,3],[11,4,12,4],[11,5,12,5],[11,6,12,6],[11,7,12,7],[11,8,12,8]]}
[null,{"$f":"Instructions!F3","v":"p-sbap5-21  •  6/5/23"}]
[null,"Air emissions from burning natural gas",null,null,null,null,null,null,null,null,null,null,"Tip: How to use this calculator"]
[null,"Natural gas combustion (less than 100 million Btu per hour)",null,null,null,null,null,null,null,null,null,null,"If you have…",null,"For potential emissions",null,"For actual emissions"]
[]
[null,"If you have a boiler with a rating of more than 100 million Btu per hour, different emission factors must be used (see EPA AP-42 Chapter 1.4).",null,null,null,null,null,null,null,null,null,null,"One process/heating unit",null,"Enter maximum rated heat input",null,"Enter amount of fuel burned or actual operation hours"]
[]
[null,"What is the total maximum rated heat input for your natural gas units?",null,null,null,null,0,"Btu per hour","(Check your units!)",null,null,null,"More than one process/heating unit",null,"Enter the total maximum rated heat input of all units, combined",null,"Enter amount of fuel burned. Do not use operation hours."]
[null,"In the previous 12 months, how many",null,null,"Choose one",null,0,{"$f":"IF(E8='Data validation'!A6,\" \",IF(E8='Data validation'!A7,\"hours/year\",IF(E8='Data validation'!A8,\"cu ft/year\")))","v":" "}]
{"$rows_left_out":42}
{"sheet":"Propane","index":4,"n_rows":50,"n_cols":17,"rows_kept":50,"cut":false,"hidden":false,"merged":[[0,1,0,10],[8,1,8,5],[8,7,8,8],[10,1,10,8],[9,1,9,8],[7,1,7,5],[7,6,7,8],[4,1,4,8],[1,1,1,10],[6,7,6,8],[5,1,5,5],[6,1,6,3],[6,4,6,5],[1,12,1,17],[2,12,3,13],[2,14,3,15],[2,16,3,17],[4,12,5,13],[4,14,5,15],[4,16,5,17],[8,16,10,17],[2,1,3,8],[47,1,47,8],[6,12,7,13],[6,14,7,15],[6,16,7,17],[15,10,16,10],[12,6,13,6],[12,7,13,7],[12,8,13,8],[12,10,13,10],[11,1,16,1],[12,2,16,2],[12,3,13,3],[12,4,13,4],[12,5,13,5],[8,12,10,13],[8,14,10,15],[48,1,48,8],[49,1,49,5],[49,6,49,7]]}
[null,{"$f":"Instructions!F3","v":"p-sbap5-21  •  6/5/23"}]
[null,"Air emissions from burning propane ",null,null,null,null,null,null,null,null,null,null,"Tip: How to use this calculator"]
[null,"Propane combustion",null,null,null,null,null,null,null,null,null,null,"If you have…",null,"For potential emissions",null,"For actual emissions"]
[]
[null,null,null,null,null,null,null,null,null,null,null,null,"One process/heating unit",null,"Enter maximum rated heat input",null,"Enter amount of fuel burned or actual operation hours"]
[null,"What is the total maximum rated heat input for your propane units?",null,null,null,null,0,"Btu per hour","(Check your units!)"]
[null,"In the previous 12 months, how many",null,null,"Choose one",null,0,{"$f":"IF(E7='Data validation'!A12,\" \",IF(E7='Data validation'!A13,\"hours/year\",IF(E7='Data validation'!A14,\"gallons/year\")))","v":" "},null,null,null,null,"More than one process/heating unit",null,"Enter the total maximum rated heat input of all units, combined",null,"Enter amount of fuel burned. Do not use operation hours."]
[]
{"$rows_left_out":43}
{"sheet":"Fuel oil","index":5,"n_rows":56,"n_cols":17,"rows_kept":56,"cut":false,"hidden":false,"merged":[[0,1,0,10],[8,7,8,8],[9,7,9,8],[10,1,10,5],[10,7,10,8],[8,1,8,3],[8,4,8,5],[7,1,7,5],[5,1,5,5],[1,1,1,10],[2,1,3,8],[9,1,9,5],[8,16,10,17],[6,12,7,13],[6,14,7,15],[6,16,7,17],[1,12,1,17],[2,12,3,13],[2,14,3,15],[2,16,3,17],[4,12,5,13],[4,14,5,15],[4,16,5,17],[8,12,10,13],[8,14,10,15],[17,10,18,10],[19,1,19,8],[28,1,28,8],[33,1,33,8],[11,1,11,8],[14,10,15,10],[14,8,15,8],[14,7,15,7],[14,6,15,6],[14,5,15,5],[14,4,15,4],[14,3,15,3],[13,1,18,1],[14,2,18,2],[53,1,53,8],[54,1,54,8],[55,1,55,5],[55,6,55,7],[12,1,12,8]]}
[null,{"$f":"Instructions!F3","v":"p-sbap5-21  •  6/5/23"}]
[null,"Air emissions from burning fuel oil ",null,null,null,null,null,null,null,null,null,null,"Tip: How to use this calculator"]
[null,"Fuel oil combustion: Fuel oil no. 1, 2 (diesel), 5, 6",null,null,null,null,null,null,null,null,null,null,"If you have…",null,"For potential emissions",null,"For actual emissions"]
[]
[null,null,null,null,null,null,null,null,null,null,null,null,"One process/heating unit",null,"Enter maximum rated heat input",null,"Enter amount of fuel burned or actual operation hours"]
[null,"What type of fuel oil do you burn?",null,null,null,null,"Choose one",{"$f":"IF($G$6='Fuel oil emission factors'!B5,'Fuel oil emission factors'!B4,IF($G$6='Fuel oil emission factors'!D5,'Fuel oil emission factors'!B4,IF($G$6='Fuel oil emission factors'!F5,'Fuel oil emission factors'!F4,IF($G$6='Fuel oil emission factors'!H5,'Fuel oil emission factors'!F4,IF($G$6='Fuel oil emission factors'!A5,\" \")))))","v":" "}]
[null,null,null,null,null,"What type of boiler do you have?","Choose one",null,null,null,null,null,"More than one process/heating unit",null,"Enter the total maximum rated heat input of all units, combined",null,"Enter amount of fuel burned. Do not use operation hours."]
[null,"What is the total maximum rated heat input for your fuel oil units?",null,null,null,null,0,"Btu per hour","(Check your units!)"]
{"$rows_left_out":49}
{"sheet":"Waste oil","index":6,"n_rows":45,"n_cols":17,"rows_kept":45,"cut":false,"hidden":false,"merged":[[0,1,0,10],[14,7,15,7],[14,10,15,10],[5,1,5,5],[1,1,1,10],[14,8,15,8],[13,1,18,1],[43,1,43,8],[44,1,44,5],[17,10,18,10],[6,7,6,8],[9,7,9,8],[10,1,10,5],[10,7,10,8],[6,1,6,3],[6,4,6,5],[7,1,7,8],[14,2,18,2],[14,3,15,3],[14,4,15,4],[14,5,15,5],[14,6,15,6],[44,6,44,7],[1,12,1,17],[2,12,3,13],[2,14,3,15],[2,16,3,17],[4,12,5,13],[4,14,5,15],[4,16,5,17],[8,12,10,13],[8,14,10,15],[8,16,10,17],[2,1,3,8],[42,1,42,8],[6,12,7,13],[6,14,7,15],[6,16,7,17],[12,1,12,8],[8,1,8,5],[9,1,9,5],[11,1,11,8],[33,7,33,8],[28,7,28,8],[19,7,19,8]]}
[null,{"$f":"Instructions!F3","v":"p-sbap5-21  •  6/5/23"}]
[null,"Air emissions from burning waste oil ",null,null,null,null,null,null,null,null,null,null,"Tip: How to use this calculator"]
[null,"Waste oil combustion",null,null,null,null,null,null,null,null,null,null,"If you have…",null,"For potential emissions",null,"For actual emissions"]
[]
[null,null,null,null,null,null,null,null,null,null,null,null,"One process/heating unit",null,"Enter maximum rated heat input",null,"Enter amount of fuel burned or actual operation hours"]
[null,"What is the total maximum rated heat input for your waste oil units?",null,null,null,null,0,"Btu per hour","(Check your units!)"]
[null,"In the previous 12 months, how many",null,null,"Choose one",null,0,{"$f":"IF(E7='Data validation'!A18,\" \",IF(E7='Data validation'!A19,\"hours/year\",IF(E7='Data validation'!A20,\"gallons/year\")))","v":" "},null,null,null,null,"More than one process/heating unit",null,"Enter the total maximum rated heat input of all units, combined",null,"Enter amount of fuel burned. Do not use operation hours."]
[]
{"$rows_left_out":38}
{"sheet":"Wood","index":7,"n_rows":74,"n_cols":17,"rows_kept":74,"cut":false,"hidden":false,"merged":[[71,1,71,8],[72,1,72,8],[73,1,73,5],[73,6,73,7],[13,2,17,2],[18,1,18,8],[27,1,27,8],[32,1,32,8],[12,1,17,1],[7,7,7,8],[11,1,11,8],[16,10,17,10],[6,1,6,5],[9,1,9,5],[9,7,9,8],[7,1,7,3],[7,4,7,5],[10,1,10,8],[13,10,14,10],[13,8,14,8],[13,7,14,7],[13,6,14,6],[13,5,14,5],[13,4,14,4],[13,3,14,3],[5,1,5,5],[0,1,0,10],[1,1,1,10],[2,1,3,8],[4,1,4,8],[5,6,5,7],[8,12,10,13],[8,14,10,15],[8,16,10,17],[6,12,7,13],[6,14,7,15],[6,16,7,17],[1,12,1,17],[2,12,3,13],[2,14,3,15],[2,16,3,17],[4,12,5,13],[4,14,5,15],[4,16,5,17]]}
[null,{"$f":"Instructions!F3","v":"p-sbap5-21  •  6/5/23"}]
[null,"Air emissions from burning wood",null,null,null,null,null,null,null,null,null,null,"Tip: How to use this calculator"]
[null,"Wood combustion: wet, dry, and bark",null,null,null,null,null,null,null,null,null,null,"If you have…",null,"For potential emissions",null,"For actual emissions"]
[]
[null,null,null,null,null,null,null,null,null,null,null,null,"One process/heating unit",null,"Enter maximum rated heat input",null,"Enter amount of fuel burned or actual operation hours"]
[null,"What type of wood do you burn?",null,null,null,null,"Choose one"]
[null,"What is the total maximum rated heat input for your wood units?",null,null,null,null,0,"Btu per hour","(Check your units!)",null,null,null,"More than one process/heating unit",null,"Enter the total maximum rated heat input of all units, combined",null,"Enter amount of fuel burned. Do not use operation hours."]
[null,"In the previous 12 months, how many",null,null,"Choose one",null,0,{"$f":"IF(E8='Data validation'!A24,\" \",IF(E8='Data validation'!A25,\"hours/year\",IF(E8='Data validation'!A26,\"tons/year\")))","v":" "}]
{"$rows_left_out":67}
{"sheet":"Potential emissions","index":8,"n_rows":65,"n_cols":9,"rows_kept":65,"cut":false,"hidden":false,"merged":[[0,1,0,8],[62,1,63,8],[64,1,64,8],[1,1,1,8],[2,1,2,8],[3,1,5,1],[3,2,4,2],[3,3,4,3],[3,4,4,4],[3,5,4,5],[3,6,4,6],[3,7,4,7],[3,8,4,8],[19,1,19,6]]}
[null,{"$f":"Instructions!F3","v":"p-sbap5-21  •  6/5/23"}]
[null,"Potential emissions: Boilers, furnaces, and space heaters"]
[null,{"$f":"IF('Data validation'!B29=\"yes\",\"The flag next to a potential emission total means your potential emissions exceed the permitting threshold and a permit is required.\",\"These pollutant totals represent the information you entered in the blue tabs.\")","v":"These pollutant totals represent the information you entered in the blue tabs."}]
[null,"Pollutant","Natural Gas","Propane","Fuel Oil","Waste Oil","Wood","Potential Emissions","Permitting Threshold"]
[]
[null,null,"(ton/yr)","(ton/yr)","(ton/yr)","(ton/yr)","(ton/yr)","(ton/yr)","(ton/yr)"]
[null,"Criteria Air Pollutants",{"$f":"IF('Natural gas'!J17=6,\"Insignificant\",0)","v":"Insignificant"},{"$f":"IF(Propane!J18=6,\"Insignificant\",\" \")","v":"Insignificant"},{"$f":"IF('Fuel oil'!J20=6,\"Insignificant\",\" \")","v":"Insignificant"},{"$f":"IF('Waste oil'!J20=6,\"Insignificant\",\" \")","v":"Insignificant"},{"$f":"IF(Wood!J19=6,\"Insignificant\",\" \")","v":"Insignificant"}]
[null,"PM",{"$f":"'Natural gas'!H18","v":0},{"$f":"Propane!H19","v":0},{"$f":"'Fuel oil'!H21","v":0},{"$f":"'Waste oil'!H21","v":0},{"$f":"Wood!H20","v":0},{"$f":"SUM(C8:G8)","v":0},100]
{"$rows_left_out":58}
{"sheet":"Actual emissions","index":9,"n_rows":62,"n_cols":9,"rows_kept":62,"cut":false,"hidden":false,"merged":[[19,1,19,6],[1,1,1,8],[2,1,2,8],[0,1,0,8],[3,1,5,1],[3,2,4,2],[3,3,4,3],[3,4,4,4],[3,5,4,5],[3,6,4,6],[3,7,4,7],[3,8,4,8]]}
[null,{"$f":"Instructions!F3","v":"p-sbap5-21  •  6/5/23"}]
[null,"Actual emissions: Boilers, funaces, and space heaters"]
[null,{"$f":"IF('Data validation'!B32=\"yes\",\"The flag next to your actual emissions total indicates that your business exceeds the Option D limit and an individual permit is required.\",\"These pollutant totals represent the information you entered in the blue tabs.\")","v":"These pollutant totals represent the information you entered in the blue tabs."}]
[null,"Pollutant","Natural Gas","Propane","Fuel Oil","Waste Oil","Wood","Actual Emissions","Opt. D Permit Limits"]
[]
[null,null,"(ton/yr)","(ton/yr)","(ton/yr)","(ton/yr)","(ton/yr)","(ton/yr)","(ton/yr)"]
[null,"Criteria Air Pollutants"]
[null,"PM",{"$f":"'Natural gas'!I18","v":0},{"$f":"Propane!I19","v":0},{"$f":"'Fuel oil'!I21","v":0},{"$f":"'Waste oil'!I21","v":0},{"$f":"Wood!I20","v":0},{"$f":"SUM(C8:G8)","v":0},50]
{"$rows_left_out":55}
{"sheet":"Permits & requirements","index":10,"n_rows":37,"n_cols":9,"rows_kept":37,"cut":false,"hidden":false,"merged":[[31,2,32,8],[33,1,35,8],[36,1,37,8],[5,1,5,8],[28,1,28,2],[28,3,28,4],[29,2,29,8],[30,2,30,8],[9,4,11,4],[17,3,20,3],[17,4,20,4],[17,7,20,7],[15,4,16,4],[17,1,20,1],[17,2,20,2],[17,8,20,8],[0,1,0,8],[1,1,1,8],[2,1,4,8],[7,5,16,8],[8,1,8,4],[15,1,16,1],[9,1,11,1],[9,2,11,2],[15,2,16,2],[15,3,16,3],[9,3,11,3],[7,1,7,4],[12,1,14,1],[12,2,14,2],[12,3,14,3],[12,4,14,4],[17,5,20,6],[21,4,26,4],[22,7,24,7],[22,8,24,8],[25,7,26,7],[25,8,26,8],[21,5,21,6],[22,5,22,6],[24,5,24,6],[25,5,25,6],[26,5,26,6],[23,5,23,6]]}
[null,{"$f":"Instructions!F3","v":"p-sbap5-21  •  6/5/23"}]
[null,"Permits and requirements"]
[null,"The need for a permit is based on your entire facility's potential air emissions. All activities that put pollutants into the air (including paint and solvent use, woodworking, or metalworking) need to be assessed in addition to your heating units. Once you determine if you need a permit, based on whether an NSPS applies and your total potential emissions, you can then use your actual emissions to see which permit is the best fit for your business."]
[]
[]
[null,"Content below is a recommendation based on the information entered into this calculator and is not a regulatory determination."]
[]
[null,"Is a permit required?",null,null,null,"What type of permit?\nAssumes all air pollutant activities are entered into this calculator.\nIf you have additional air emission sources, the recommendation below cannot be used. You must assess your facility's total potential emissions from all sources to identify your permitting needs."]
{"$rows_left_out":30}
{"sheet":"Fuel oil emission factors","index":11,"n_rows":70,"n_cols":9,"rows_kept":70,"cut":false,"hidden":false,"merged":[[1,0,1,8],[0,0,0,8],[2,1,2,8],[69,1,69,3],[54,1,54,2],[55,1,55,3],[3,5,3,8],[3,1,3,4]]}
[{"$f":"Instructions!F3","v":"p-sbap5-21  •  6/5/23"}]
["Emission factors - Fuel oil"]
[null,"Factors from AP-42 Chapter 1.3 Fuel Oil Combustion, May 2010"]
[null,"Distillate Oil",null,null,null,"Residual Oil"]
["Choose one","Fuel Oil No. 1",null,"Fuel Oil No. 2",null,"Fuel Oil No. 5",null,"Fuel Oil No. 6"]
[null,"Commercial","Industrial","Commercial","Industrial","Commercial","Industrial","Commercial","Industrial"]
["Source","Assume No. 1 = No. 2","Assume No. 1 = No. 2","Table 1.3-1 <100 MMBtu","Table 1.3-6","Table 1.3-7","Table 1.3-5","Table 1.3-7","Table 1.5-5"]
["Units","lb/gal","lb/gal","lb/gal","lb/gal","lb/gal","lb/gal","lb/gal","lb/gal"]
{"$rows_left_out":63}
{"sheet":"Wood emission factors","index":12,"n_rows":129,"n_cols":9,"rows_kept":129,"cut":false,"hidden":false,"merged":[[1,0,1,4],[63,6,63,7],[76,6,76,8],[58,6,59,6],[64,1,64,3],[63,0,63,3],[58,5,59,5]]}
[null,null,null,null,{"$f":"Instructions!F3","v":"p-sbap5-21  •  6/5/23"}]
["Emission factors - Wood"]
["Factors from AP-42 Chapter 1.6 Wood Residue Combustion, Sept. 2003","Factors from AP-42 Chapter 1.6 Wood Residue Combustion, Sept. 2003"]
["Wood Type",{"$f":"BBW","v":"Bark or Bark with Wet Wood"},{"$f":"WW","v":"Wet Wood"},{"$f":"DW","v":"Dry Wood"},{"$f":"AWT","v":"All Wood Types"}]
["Moisture",0.5,0.4,0.2]
["Heat Value (Btu/ton)",{"$f":"D61","v":8740000},{"$f":"D62","v":10488000},{"$f":"D63","v":17480000},{"$f":"MIN(B6:D6)","v":8740000}]
["Units","lb/ton","lb/ton","lb/ton","lb/ton"]
["PM",{"$f":"B76*B$6/1000000","v":4.8944000000000001},3.4610400000000001,6.992,{"$f":"MAX(B8:D8)","v":6.992}]
{"$rows_left_out":122}
{"sheet":"Data validation","index":13,"n_rows":45,"n_cols":2,"rows_kept":45,"cut":false,"hidden":true,"merged":[[0,0,0,1],[1,0,1,1]]}
[{"$f":"Instructions!F3","v":"p-sbap5-21  •  6/5/23"}]
["Data validation"]
[]
["Acutal emission entries:","Options for fuel types:"]
["Natural Gas","Fuel Oil"]
["Choose one","Choose one"]
["hours were the units operated?","Fuel Oil No. 1"]
["cubic feet of natural gas were burned?","Fuel Oil No. 2"]
{"$rows_left_out":37}